HelenOS continuous integration testing

Build 125 from 2018-01-25 01:15:13+01:00 (2 min 4 s)

Summary results

Task Success Details (total = ok + failed + skipped)
Repository checkouts 100 % 2 = 2 + 0 + 0
HelenOS builds 0 % 16 = 0 + 16 + 0
Tarball fetches for Coastline 100 % 14 = 14 + 0 + 0
Coastline builds 0 % 210 = 0 + 0 + 210
Testing scenarios 0 % 60 = 0 + 0 + 60

Summary matrix(back to top)

amd64 arm32 beagle­board­xm arm32 beagle­bone arm32 gta02 arm32 inte­gra­torcp arm32 rasp­ber­ry­pi ia32 ia64 i460GX ia64 ski mips32 malta­-be mips32 malta­-le mips32 msim ppc32 sparc64 niagara sparc64 ultra special abs32le
HelenOS Failed Failed Failed Failed Failed Failed Failed Failed Failed Failed Failed Failed Failed Failed Failed Failed
binutils Skipped Skipped Skipped Skipped Skipped Skipped Skipped Skipped Skipped Skipped Skipped Skipped Skipped Skipped Skipped N/A
fdlibm Skipped Skipped Skipped Skipped Skipped Skipped Skipped Skipped Skipped Skipped Skipped Skipped Skipped Skipped Skipped N/A
gcc Skipped Skipped Skipped Skipped Skipped Skipped Skipped Skipped Skipped Skipped Skipped Skipped Skipped Skipped Skipped N/A
jainja Skipped Skipped Skipped Skipped Skipped Skipped Skipped Skipped Skipped Skipped Skipped Skipped Skipped Skipped Skipped N/A
libgmp Skipped Skipped Skipped Skipped Skipped Skipped Skipped Skipped Skipped Skipped Skipped Skipped Skipped Skipped Skipped N/A
libiconv Skipped Skipped Skipped Skipped Skipped Skipped Skipped Skipped Skipped Skipped Skipped Skipped Skipped Skipped Skipped N/A
libisl Skipped Skipped Skipped Skipped Skipped Skipped Skipped Skipped Skipped Skipped Skipped Skipped Skipped Skipped Skipped N/A
libmpc Skipped Skipped Skipped Skipped Skipped Skipped Skipped Skipped Skipped Skipped Skipped Skipped Skipped Skipped Skipped N/A
libmpfr Skipped Skipped Skipped Skipped Skipped Skipped Skipped Skipped Skipped Skipped Skipped Skipped Skipped Skipped Skipped N/A
libpng Skipped Skipped Skipped Skipped Skipped Skipped Skipped Skipped Skipped Skipped Skipped Skipped Skipped Skipped Skipped N/A
msim Skipped Skipped Skipped Skipped Skipped Skipped Skipped Skipped Skipped Skipped Skipped Skipped Skipped Skipped Skipped N/A
pcc Skipped Skipped Skipped Skipped Skipped Skipped Skipped Skipped Skipped Skipped Skipped Skipped Skipped Skipped Skipped N/A
python2 Skipped Skipped Skipped Skipped Skipped Skipped Skipped Skipped Skipped Skipped Skipped Skipped Skipped Skipped Skipped N/A
zlib Skipped Skipped Skipped Skipped Skipped Skipped Skipped Skipped Skipped Skipped Skipped Skipped Skipped Skipped Skipped N/A
base/fs.test Skipped N/A N/A N/A Skipped N/A Skipped N/A N/A N/A N/A N/A Skipped N/A N/A N/A
base/tester_malloc1.test Skipped N/A N/A N/A Skipped N/A Skipped N/A N/A N/A N/A N/A Skipped N/A N/A N/A
boot.test Skipped N/A N/A N/A Skipped N/A Skipped N/A N/A N/A N/A N/A Skipped N/A N/A N/A
coast/gcc/version.test Skipped N/A N/A N/A Skipped N/A Skipped N/A N/A N/A N/A N/A Skipped N/A N/A N/A
coast/libgmp/smoke.test Skipped N/A N/A N/A Skipped N/A Skipped N/A N/A N/A N/A N/A Skipped N/A N/A N/A
coast/libiconv/version.test Skipped N/A N/A N/A Skipped N/A Skipped N/A N/A N/A N/A N/A Skipped N/A N/A N/A
coast/libisl/smoke.test Skipped N/A N/A N/A Skipped N/A Skipped N/A N/A N/A N/A N/A Skipped N/A N/A N/A
coast/libmpc/smoke.test Skipped N/A N/A N/A Skipped N/A Skipped N/A N/A N/A N/A N/A Skipped N/A N/A N/A
coast/libmpfr/smoke.test Skipped N/A N/A N/A Skipped N/A Skipped N/A N/A N/A N/A N/A Skipped N/A N/A N/A
coast/libpng/pngtest.test Skipped N/A N/A N/A Skipped N/A Skipped N/A N/A N/A N/A N/A Skipped N/A N/A N/A
coast/pcc/hello.test Skipped N/A N/A N/A Skipped N/A Skipped N/A N/A N/A N/A N/A Skipped N/A N/A N/A
coast/pcc/version.test Skipped N/A N/A N/A Skipped N/A Skipped N/A N/A N/A N/A N/A Skipped N/A N/A N/A
coast/python2/hello.test Skipped N/A N/A N/A Skipped N/A Skipped N/A N/A N/A N/A N/A Skipped N/A N/A N/A
coast/python2/version.test Skipped N/A N/A N/A Skipped N/A Skipped N/A N/A N/A N/A N/A Skipped N/A N/A N/A
coast/zlib/minigzip.test Skipped N/A N/A N/A Skipped N/A Skipped N/A N/A N/A N/A N/A Skipped N/A N/A N/A

Miscellaneous

List of failed tasks (back to top)

Task Component Architecture Log Duration
HelenOS amd64 View (tail) 4 s
The compiler did not produce the output file "probe.s".


/usr/local/cross/amd64-unknown-elf/libexec/gcc/amd64-unknown-elf/7.1.0/cc1: error while loading shared libraries: libmpfr.so.4: cannot open shared object file: No such file or directory

######################################################################

/usr/local/cross/amd64-unknown-elf/libexec/gcc/amd64-unknown-elf/7.1.0/cc1: error while loading shared libraries: libmpfr.so.4: cannot open shared object file: No such file or directory

make: *** [Makefile:108: Makefile.common] Error 1
HelenOS arm32/beagleboardxm View (tail) 5 s
The compiler did not produce the output file "probe.s".


/usr/local/cross/arm-linux-gnueabi/libexec/gcc/arm-linux-gnueabi/7.1.0/cc1: error while loading shared libraries: libmpfr.so.4: cannot open shared object file: No such file or directory

######################################################################

/usr/local/cross/arm-linux-gnueabi/libexec/gcc/arm-linux-gnueabi/7.1.0/cc1: error while loading shared libraries: libmpfr.so.4: cannot open shared object file: No such file or directory

make: *** [Makefile:108: Makefile.common] Error 1
HelenOS arm32/beaglebone View (tail) 4 s
The compiler did not produce the output file "probe.s".


/usr/local/cross/arm-linux-gnueabi/libexec/gcc/arm-linux-gnueabi/7.1.0/cc1: error while loading shared libraries: libmpfr.so.4: cannot open shared object file: No such file or directory

######################################################################

/usr/local/cross/arm-linux-gnueabi/libexec/gcc/arm-linux-gnueabi/7.1.0/cc1: error while loading shared libraries: libmpfr.so.4: cannot open shared object file: No such file or directory

make: *** [Makefile:108: Makefile.common] Error 1
HelenOS arm32/gta02 View (tail) 4 s
The compiler did not produce the output file "probe.s".


/usr/local/cross/arm-linux-gnueabi/libexec/gcc/arm-linux-gnueabi/7.1.0/cc1: error while loading shared libraries: libmpfr.so.4: cannot open shared object file: No such file or directory

######################################################################

/usr/local/cross/arm-linux-gnueabi/libexec/gcc/arm-linux-gnueabi/7.1.0/cc1: error while loading shared libraries: libmpfr.so.4: cannot open shared object file: No such file or directory

make: *** [Makefile:108: Makefile.common] Error 1
HelenOS arm32/integratorcp View (tail) 4 s
The compiler did not produce the output file "probe.s".


/usr/local/cross/arm-linux-gnueabi/libexec/gcc/arm-linux-gnueabi/7.1.0/cc1: error while loading shared libraries: libmpfr.so.4: cannot open shared object file: No such file or directory

######################################################################

/usr/local/cross/arm-linux-gnueabi/libexec/gcc/arm-linux-gnueabi/7.1.0/cc1: error while loading shared libraries: libmpfr.so.4: cannot open shared object file: No such file or directory

make: *** [Makefile:108: Makefile.common] Error 1
HelenOS arm32/raspberrypi View (tail) 5 s
The compiler did not produce the output file "probe.s".


/usr/local/cross/arm-linux-gnueabi/libexec/gcc/arm-linux-gnueabi/7.1.0/cc1: error while loading shared libraries: libmpfr.so.4: cannot open shared object file: No such file or directory

######################################################################

/usr/local/cross/arm-linux-gnueabi/libexec/gcc/arm-linux-gnueabi/7.1.0/cc1: error while loading shared libraries: libmpfr.so.4: cannot open shared object file: No such file or directory

make: *** [Makefile:108: Makefile.common] Error 1
HelenOS ia32 View (tail) 6 s
The compiler did not produce the output file "probe.s".


/usr/local/cross/i686-pc-linux-gnu/libexec/gcc/i686-pc-linux-gnu/7.1.0/cc1: error while loading shared libraries: libmpfr.so.4: cannot open shared object file: No such file or directory

######################################################################

/usr/local/cross/i686-pc-linux-gnu/libexec/gcc/i686-pc-linux-gnu/7.1.0/cc1: error while loading shared libraries: libmpfr.so.4: cannot open shared object file: No such file or directory

make: *** [Makefile:108: Makefile.common] Error 1
HelenOS ia64/i460GX View (tail) 5 s
The compiler did not produce the output file "probe.s".


/usr/local/cross/ia64-pc-linux-gnu/libexec/gcc/ia64-pc-linux-gnu/7.1.0/cc1: error while loading shared libraries: libmpfr.so.4: cannot open shared object file: No such file or directory

######################################################################

/usr/local/cross/ia64-pc-linux-gnu/libexec/gcc/ia64-pc-linux-gnu/7.1.0/cc1: error while loading shared libraries: libmpfr.so.4: cannot open shared object file: No such file or directory

make: *** [Makefile:108: Makefile.common] Error 1
HelenOS ia64/ski View (tail) 4 s
The compiler did not produce the output file "probe.s".


/usr/local/cross/ia64-pc-linux-gnu/libexec/gcc/ia64-pc-linux-gnu/7.1.0/cc1: error while loading shared libraries: libmpfr.so.4: cannot open shared object file: No such file or directory

######################################################################

/usr/local/cross/ia64-pc-linux-gnu/libexec/gcc/ia64-pc-linux-gnu/7.1.0/cc1: error while loading shared libraries: libmpfr.so.4: cannot open shared object file: No such file or directory

make: *** [Makefile:108: Makefile.common] Error 1
HelenOS mips32/malta-be View (tail) 5 s
The compiler did not produce the output file "probe.s".


/usr/local/cross/mips-linux-gnu/libexec/gcc/mips-linux-gnu/7.1.0/cc1: error while loading shared libraries: libmpfr.so.4: cannot open shared object file: No such file or directory

######################################################################

/usr/local/cross/mips-linux-gnu/libexec/gcc/mips-linux-gnu/7.1.0/cc1: error while loading shared libraries: libmpfr.so.4: cannot open shared object file: No such file or directory

make: *** [Makefile:108: Makefile.common] Error 1
HelenOS mips32/malta-le View (tail) 7 s
The compiler did not produce the output file "probe.s".


/usr/local/cross/mipsel-linux-gnu/libexec/gcc/mipsel-linux-gnu/7.1.0/cc1: error while loading shared libraries: libmpfr.so.4: cannot open shared object file: No such file or directory

######################################################################

/usr/local/cross/mipsel-linux-gnu/libexec/gcc/mipsel-linux-gnu/7.1.0/cc1: error while loading shared libraries: libmpfr.so.4: cannot open shared object file: No such file or directory

make: *** [Makefile:108: Makefile.common] Error 1
HelenOS mips32/msim View (tail) 5 s
The compiler did not produce the output file "probe.s".


/usr/local/cross/mipsel-linux-gnu/libexec/gcc/mipsel-linux-gnu/7.1.0/cc1: error while loading shared libraries: libmpfr.so.4: cannot open shared object file: No such file or directory

######################################################################

/usr/local/cross/mipsel-linux-gnu/libexec/gcc/mipsel-linux-gnu/7.1.0/cc1: error while loading shared libraries: libmpfr.so.4: cannot open shared object file: No such file or directory

make: *** [Makefile:108: Makefile.common] Error 1
HelenOS ppc32 View (tail) 6 s
The compiler did not produce the output file "probe.s".


/usr/local/cross/ppc-linux-gnu/libexec/gcc/ppc-linux-gnu/7.1.0/cc1: error while loading shared libraries: libmpfr.so.4: cannot open shared object file: No such file or directory

######################################################################

/usr/local/cross/ppc-linux-gnu/libexec/gcc/ppc-linux-gnu/7.1.0/cc1: error while loading shared libraries: libmpfr.so.4: cannot open shared object file: No such file or directory

make: *** [Makefile:108: Makefile.common] Error 1
HelenOS sparc64/niagara View (tail) 7 s
The compiler did not produce the output file "probe.s".


/usr/local/cross/sparc64-linux-gnu/libexec/gcc/sparc64-linux-gnu/7.1.0/cc1: error while loading shared libraries: libmpfr.so.4: cannot open shared object file: No such file or directory

######################################################################

/usr/local/cross/sparc64-linux-gnu/libexec/gcc/sparc64-linux-gnu/7.1.0/cc1: error while loading shared libraries: libmpfr.so.4: cannot open shared object file: No such file or directory

make: *** [Makefile:108: Makefile.common] Error 1
HelenOS sparc64/ultra View (tail) 4 s
The compiler did not produce the output file "probe.s".


/usr/local/cross/sparc64-linux-gnu/libexec/gcc/sparc64-linux-gnu/7.1.0/cc1: error while loading shared libraries: libmpfr.so.4: cannot open shared object file: No such file or directory

######################################################################

/usr/local/cross/sparc64-linux-gnu/libexec/gcc/sparc64-linux-gnu/7.1.0/cc1: error while loading shared libraries: libmpfr.so.4: cannot open shared object file: No such file or directory

make: *** [Makefile:108: Makefile.common] Error 1
HelenOS special/abs32le View (tail) 7 s
The compiler did not produce the output file "probe.s".


/usr/local/cross/i686-pc-linux-gnu/libexec/gcc/i686-pc-linux-gnu/7.1.0/cc1: error while loading shared libraries: libmpfr.so.4: cannot open shared object file: No such file or directory

######################################################################

/usr/local/cross/i686-pc-linux-gnu/libexec/gcc/i686-pc-linux-gnu/7.1.0/cc1: error while loading shared libraries: libmpfr.so.4: cannot open shared object file: No such file or directory

make: *** [Makefile:108: Makefile.common] Error 1

HelenOS (back to top)

Architecture Result Download Log Duration
OK Browsable sources View 2 min 1 s
amd64 Failed View (tail) 4 s
The compiler did not produce the output file "probe.s".


/usr/local/cross/amd64-unknown-elf/libexec/gcc/amd64-unknown-elf/7.1.0/cc1: error while loading shared libraries: libmpfr.so.4: cannot open shared object file: No such file or directory

######################################################################

/usr/local/cross/amd64-unknown-elf/libexec/gcc/amd64-unknown-elf/7.1.0/cc1: error while loading shared libraries: libmpfr.so.4: cannot open shared object file: No such file or directory

make: *** [Makefile:108: Makefile.common] Error 1
arm32/beagleboardxm Failed View (tail) 5 s
The compiler did not produce the output file "probe.s".


/usr/local/cross/arm-linux-gnueabi/libexec/gcc/arm-linux-gnueabi/7.1.0/cc1: error while loading shared libraries: libmpfr.so.4: cannot open shared object file: No such file or directory

######################################################################

/usr/local/cross/arm-linux-gnueabi/libexec/gcc/arm-linux-gnueabi/7.1.0/cc1: error while loading shared libraries: libmpfr.so.4: cannot open shared object file: No such file or directory

make: *** [Makefile:108: Makefile.common] Error 1
arm32/beaglebone Failed View (tail) 4 s
The compiler did not produce the output file "probe.s".


/usr/local/cross/arm-linux-gnueabi/libexec/gcc/arm-linux-gnueabi/7.1.0/cc1: error while loading shared libraries: libmpfr.so.4: cannot open shared object file: No such file or directory

######################################################################

/usr/local/cross/arm-linux-gnueabi/libexec/gcc/arm-linux-gnueabi/7.1.0/cc1: error while loading shared libraries: libmpfr.so.4: cannot open shared object file: No such file or directory

make: *** [Makefile:108: Makefile.common] Error 1
arm32/gta02 Failed View (tail) 4 s
The compiler did not produce the output file "probe.s".


/usr/local/cross/arm-linux-gnueabi/libexec/gcc/arm-linux-gnueabi/7.1.0/cc1: error while loading shared libraries: libmpfr.so.4: cannot open shared object file: No such file or directory

######################################################################

/usr/local/cross/arm-linux-gnueabi/libexec/gcc/arm-linux-gnueabi/7.1.0/cc1: error while loading shared libraries: libmpfr.so.4: cannot open shared object file: No such file or directory

make: *** [Makefile:108: Makefile.common] Error 1
arm32/integratorcp Failed View (tail) 4 s
The compiler did not produce the output file "probe.s".


/usr/local/cross/arm-linux-gnueabi/libexec/gcc/arm-linux-gnueabi/7.1.0/cc1: error while loading shared libraries: libmpfr.so.4: cannot open shared object file: No such file or directory

######################################################################

/usr/local/cross/arm-linux-gnueabi/libexec/gcc/arm-linux-gnueabi/7.1.0/cc1: error while loading shared libraries: libmpfr.so.4: cannot open shared object file: No such file or directory

make: *** [Makefile:108: Makefile.common] Error 1
arm32/raspberrypi Failed View (tail) 5 s
The compiler did not produce the output file "probe.s".


/usr/local/cross/arm-linux-gnueabi/libexec/gcc/arm-linux-gnueabi/7.1.0/cc1: error while loading shared libraries: libmpfr.so.4: cannot open shared object file: No such file or directory

######################################################################

/usr/local/cross/arm-linux-gnueabi/libexec/gcc/arm-linux-gnueabi/7.1.0/cc1: error while loading shared libraries: libmpfr.so.4: cannot open shared object file: No such file or directory

make: *** [Makefile:108: Makefile.common] Error 1
ia32 Failed View (tail) 6 s
The compiler did not produce the output file "probe.s".


/usr/local/cross/i686-pc-linux-gnu/libexec/gcc/i686-pc-linux-gnu/7.1.0/cc1: error while loading shared libraries: libmpfr.so.4: cannot open shared object file: No such file or directory

######################################################################

/usr/local/cross/i686-pc-linux-gnu/libexec/gcc/i686-pc-linux-gnu/7.1.0/cc1: error while loading shared libraries: libmpfr.so.4: cannot open shared object file: No such file or directory

make: *** [Makefile:108: Makefile.common] Error 1
ia64/i460GX Failed View (tail) 5 s
The compiler did not produce the output file "probe.s".


/usr/local/cross/ia64-pc-linux-gnu/libexec/gcc/ia64-pc-linux-gnu/7.1.0/cc1: error while loading shared libraries: libmpfr.so.4: cannot open shared object file: No such file or directory

######################################################################

/usr/local/cross/ia64-pc-linux-gnu/libexec/gcc/ia64-pc-linux-gnu/7.1.0/cc1: error while loading shared libraries: libmpfr.so.4: cannot open shared object file: No such file or directory

make: *** [Makefile:108: Makefile.common] Error 1
ia64/ski Failed View (tail) 4 s
The compiler did not produce the output file "probe.s".


/usr/local/cross/ia64-pc-linux-gnu/libexec/gcc/ia64-pc-linux-gnu/7.1.0/cc1: error while loading shared libraries: libmpfr.so.4: cannot open shared object file: No such file or directory

######################################################################

/usr/local/cross/ia64-pc-linux-gnu/libexec/gcc/ia64-pc-linux-gnu/7.1.0/cc1: error while loading shared libraries: libmpfr.so.4: cannot open shared object file: No such file or directory

make: *** [Makefile:108: Makefile.common] Error 1
mips32/malta-be Failed View (tail) 5 s
The compiler did not produce the output file "probe.s".


/usr/local/cross/mips-linux-gnu/libexec/gcc/mips-linux-gnu/7.1.0/cc1: error while loading shared libraries: libmpfr.so.4: cannot open shared object file: No such file or directory

######################################################################

/usr/local/cross/mips-linux-gnu/libexec/gcc/mips-linux-gnu/7.1.0/cc1: error while loading shared libraries: libmpfr.so.4: cannot open shared object file: No such file or directory

make: *** [Makefile:108: Makefile.common] Error 1
mips32/malta-le Failed View (tail) 7 s
The compiler did not produce the output file "probe.s".


/usr/local/cross/mipsel-linux-gnu/libexec/gcc/mipsel-linux-gnu/7.1.0/cc1: error while loading shared libraries: libmpfr.so.4: cannot open shared object file: No such file or directory

######################################################################

/usr/local/cross/mipsel-linux-gnu/libexec/gcc/mipsel-linux-gnu/7.1.0/cc1: error while loading shared libraries: libmpfr.so.4: cannot open shared object file: No such file or directory

make: *** [Makefile:108: Makefile.common] Error 1
mips32/msim Failed View (tail) 5 s
The compiler did not produce the output file "probe.s".


/usr/local/cross/mipsel-linux-gnu/libexec/gcc/mipsel-linux-gnu/7.1.0/cc1: error while loading shared libraries: libmpfr.so.4: cannot open shared object file: No such file or directory

######################################################################

/usr/local/cross/mipsel-linux-gnu/libexec/gcc/mipsel-linux-gnu/7.1.0/cc1: error while loading shared libraries: libmpfr.so.4: cannot open shared object file: No such file or directory

make: *** [Makefile:108: Makefile.common] Error 1
ppc32 Failed View (tail) 6 s
The compiler did not produce the output file "probe.s".


/usr/local/cross/ppc-linux-gnu/libexec/gcc/ppc-linux-gnu/7.1.0/cc1: error while loading shared libraries: libmpfr.so.4: cannot open shared object file: No such file or directory

######################################################################

/usr/local/cross/ppc-linux-gnu/libexec/gcc/ppc-linux-gnu/7.1.0/cc1: error while loading shared libraries: libmpfr.so.4: cannot open shared object file: No such file or directory

make: *** [Makefile:108: Makefile.common] Error 1
sparc64/niagara Failed View (tail) 7 s
The compiler did not produce the output file "probe.s".


/usr/local/cross/sparc64-linux-gnu/libexec/gcc/sparc64-linux-gnu/7.1.0/cc1: error while loading shared libraries: libmpfr.so.4: cannot open shared object file: No such file or directory

######################################################################

/usr/local/cross/sparc64-linux-gnu/libexec/gcc/sparc64-linux-gnu/7.1.0/cc1: error while loading shared libraries: libmpfr.so.4: cannot open shared object file: No such file or directory

make: *** [Makefile:108: Makefile.common] Error 1
sparc64/ultra Failed View (tail) 4 s
The compiler did not produce the output file "probe.s".


/usr/local/cross/sparc64-linux-gnu/libexec/gcc/sparc64-linux-gnu/7.1.0/cc1: error while loading shared libraries: libmpfr.so.4: cannot open shared object file: No such file or directory

######################################################################

/usr/local/cross/sparc64-linux-gnu/libexec/gcc/sparc64-linux-gnu/7.1.0/cc1: error while loading shared libraries: libmpfr.so.4: cannot open shared object file: No such file or directory

make: *** [Makefile:108: Makefile.common] Error 1
special/abs32le Failed View (tail) 7 s
The compiler did not produce the output file "probe.s".


/usr/local/cross/i686-pc-linux-gnu/libexec/gcc/i686-pc-linux-gnu/7.1.0/cc1: error while loading shared libraries: libmpfr.so.4: cannot open shared object file: No such file or directory

######################################################################

/usr/local/cross/i686-pc-linux-gnu/libexec/gcc/i686-pc-linux-gnu/7.1.0/cc1: error while loading shared libraries: libmpfr.so.4: cannot open shared object file: No such file or directory

make: *** [Makefile:108: Makefile.common] Error 1

Per-architecture details (back to top)

amd64(back to top)

Task Result Download Log Duration
HelenOS Failed View (tail) 4 s
The compiler did not produce the output file "probe.s".


/usr/local/cross/amd64-unknown-elf/libexec/gcc/amd64-unknown-elf/7.1.0/cc1: error while loading shared libraries: libmpfr.so.4: cannot open shared object file: No such file or directory

######################################################################

/usr/local/cross/amd64-unknown-elf/libexec/gcc/amd64-unknown-elf/7.1.0/cc1: error while loading shared libraries: libmpfr.so.4: cannot open shared object file: No such file or directory

make: *** [Makefile:108: Makefile.common] Error 1
binutils Skipped View (tail)
Skipped: dependency coastline-prepare-for-amd64 failed (or also skipped).
fdlibm Skipped View (tail)
Skipped: dependency coastline-prepare-for-amd64 failed (or also skipped).
jainja Skipped View (tail)
Skipped: dependency coastline-prepare-for-amd64 failed (or also skipped).
libgmp Skipped View (tail)
Skipped: dependency coastline-prepare-for-amd64 failed (or also skipped).
libiconv Skipped View (tail)
Skipped: dependency coastline-prepare-for-amd64 failed (or also skipped).
msim Skipped View (tail)
Skipped: dependency coastline-prepare-for-amd64 failed (or also skipped).
pcc Skipped View (tail)
Skipped: dependency coastline-prepare-for-amd64 failed (or also skipped).
zlib Skipped View (tail)
Skipped: dependency coastline-prepare-for-amd64 failed (or also skipped).
libisl Skipped View (tail)
Skipped: dependency coastline-build-libgmp-for-amd64 failed (or also skipped).
libmpfr Skipped View (tail)
Skipped: dependency coastline-build-fdlibm-for-amd64 failed (or also skipped).
libpng Skipped View (tail)
Skipped: dependency coastline-build-zlib-for-amd64 failed (or also skipped).
python2 Skipped View (tail)
Skipped: dependency coastline-build-fdlibm-for-amd64 failed (or also skipped).
libmpc Skipped View (tail)
Skipped: dependency coastline-build-libmpfr-for-amd64 failed (or also skipped).
gcc Skipped View (tail)
Skipped: dependency coastline-build-zlib-for-amd64 failed (or also skipped).
HelenOS with libmpc Skipped View (tail)
Skipped: dependency helenos-build-amd64 failed (or also skipped).
HelenOS with python2 Skipped View (tail)
Skipped: dependency helenos-build-amd64 failed (or also skipped).
HelenOS with zlib Skipped View (tail)
Skipped: dependency helenos-build-amd64 failed (or also skipped).
HelenOS with libisl Skipped View (tail)
Skipped: dependency helenos-build-amd64 failed (or also skipped).
HelenOS with libmpfr Skipped View (tail)
Skipped: dependency helenos-build-amd64 failed (or also skipped).
HelenOS with gcc Skipped View (tail)
Skipped: dependency helenos-build-amd64 failed (or also skipped).
HelenOS with binutils,pcc Skipped View (tail)
Skipped: dependency helenos-build-amd64 failed (or also skipped).
HelenOS with pcc Skipped View (tail)
Skipped: dependency helenos-build-amd64 failed (or also skipped).
HelenOS with libgmp Skipped View (tail)
Skipped: dependency helenos-build-amd64 failed (or also skipped).
HelenOS with libiconv Skipped View (tail)
Skipped: dependency helenos-build-amd64 failed (or also skipped).
HelenOS with libpng Skipped View (tail)
Skipped: dependency helenos-build-amd64 failed (or also skipped).
coast/libmpc/smoke.test Skipped View (tail)
Skipped: dependency extra-amd64-with-libmpc failed (or also skipped).
coast/python2/hello.test Skipped View (tail)
Skipped: dependency extra-amd64-with-python2 failed (or also skipped).
coast/python2/version.test Skipped View (tail)
Skipped: dependency extra-amd64-with-python2 failed (or also skipped).
coast/zlib/minigzip.test Skipped View (tail)
Skipped: dependency extra-amd64-with-zlib failed (or also skipped).
coast/libisl/smoke.test Skipped View (tail)
Skipped: dependency extra-amd64-with-libisl failed (or also skipped).
coast/libmpfr/smoke.test Skipped View (tail)
Skipped: dependency extra-amd64-with-libmpfr failed (or also skipped).
coast/gcc/version.test Skipped View (tail)
Skipped: dependency extra-amd64-with-gcc failed (or also skipped).
coast/pcc/hello.test Skipped View (tail)
Skipped: dependency extra-amd64-with-binutils-pcc failed (or also skipped).
coast/pcc/version.test Skipped View (tail)
Skipped: dependency extra-amd64-with-pcc failed (or also skipped).
coast/libgmp/smoke.test Skipped View (tail)
Skipped: dependency extra-amd64-with-libgmp failed (or also skipped).
coast/libiconv/version.test Skipped View (tail)
Skipped: dependency extra-amd64-with-libiconv failed (or also skipped).
coast/libpng/pngtest.test Skipped View (tail)
Skipped: dependency extra-amd64-with-libpng failed (or also skipped).
base/fs.test Skipped View (tail)
Skipped: dependency helenos-build-amd64 failed (or also skipped).
base/tester_malloc1.test Skipped View (tail)
Skipped: dependency helenos-build-amd64 failed (or also skipped).
boot.test Skipped View (tail)
Skipped: dependency helenos-build-amd64 failed (or also skipped).

arm32/beagleboardxm(back to top)

Task Result Download Log Duration
HelenOS Failed View (tail) 5 s
The compiler did not produce the output file "probe.s".


/usr/local/cross/arm-linux-gnueabi/libexec/gcc/arm-linux-gnueabi/7.1.0/cc1: error while loading shared libraries: libmpfr.so.4: cannot open shared object file: No such file or directory

######################################################################

/usr/local/cross/arm-linux-gnueabi/libexec/gcc/arm-linux-gnueabi/7.1.0/cc1: error while loading shared libraries: libmpfr.so.4: cannot open shared object file: No such file or directory

make: *** [Makefile:108: Makefile.common] Error 1
binutils Skipped View (tail)
Skipped: dependency coastline-prepare-for-arm32-beagleboardxm failed (or also skipped).
fdlibm Skipped View (tail)
Skipped: dependency coastline-prepare-for-arm32-beagleboardxm failed (or also skipped).
jainja Skipped View (tail)
Skipped: dependency coastline-prepare-for-arm32-beagleboardxm failed (or also skipped).
libgmp Skipped View (tail)
Skipped: dependency coastline-prepare-for-arm32-beagleboardxm failed (or also skipped).
libiconv Skipped View (tail)
Skipped: dependency coastline-prepare-for-arm32-beagleboardxm failed (or also skipped).
msim Skipped View (tail)
Skipped: dependency coastline-prepare-for-arm32-beagleboardxm failed (or also skipped).
pcc Skipped View (tail)
Skipped: dependency coastline-prepare-for-arm32-beagleboardxm failed (or also skipped).
zlib Skipped View (tail)
Skipped: dependency coastline-prepare-for-arm32-beagleboardxm failed (or also skipped).
libisl Skipped View (tail)
Skipped: dependency coastline-build-libgmp-for-arm32-beagleboardxm failed (or also skipped).
libmpfr Skipped View (tail)
Skipped: dependency coastline-build-fdlibm-for-arm32-beagleboardxm failed (or also skipped).
libpng Skipped View (tail)
Skipped: dependency coastline-build-zlib-for-arm32-beagleboardxm failed (or also skipped).
python2 Skipped View (tail)
Skipped: dependency coastline-build-fdlibm-for-arm32-beagleboardxm failed (or also skipped).
libmpc Skipped View (tail)
Skipped: dependency coastline-build-libmpfr-for-arm32-beagleboardxm failed (or also skipped).
gcc Skipped View (tail)
Skipped: dependency coastline-build-zlib-for-arm32-beagleboardxm failed (or also skipped).

arm32/beaglebone(back to top)

Task Result Download Log Duration
HelenOS Failed View (tail) 4 s
The compiler did not produce the output file "probe.s".


/usr/local/cross/arm-linux-gnueabi/libexec/gcc/arm-linux-gnueabi/7.1.0/cc1: error while loading shared libraries: libmpfr.so.4: cannot open shared object file: No such file or directory

######################################################################

/usr/local/cross/arm-linux-gnueabi/libexec/gcc/arm-linux-gnueabi/7.1.0/cc1: error while loading shared libraries: libmpfr.so.4: cannot open shared object file: No such file or directory

make: *** [Makefile:108: Makefile.common] Error 1
binutils Skipped View (tail)
Skipped: dependency coastline-prepare-for-arm32-beaglebone failed (or also skipped).
fdlibm Skipped View (tail)
Skipped: dependency coastline-prepare-for-arm32-beaglebone failed (or also skipped).
jainja Skipped View (tail)
Skipped: dependency coastline-prepare-for-arm32-beaglebone failed (or also skipped).
libgmp Skipped View (tail)
Skipped: dependency coastline-prepare-for-arm32-beaglebone failed (or also skipped).
libiconv Skipped View (tail)
Skipped: dependency coastline-prepare-for-arm32-beaglebone failed (or also skipped).
msim Skipped View (tail)
Skipped: dependency coastline-prepare-for-arm32-beaglebone failed (or also skipped).
pcc Skipped View (tail)
Skipped: dependency coastline-prepare-for-arm32-beaglebone failed (or also skipped).
zlib Skipped View (tail)
Skipped: dependency coastline-prepare-for-arm32-beaglebone failed (or also skipped).
libisl Skipped View (tail)
Skipped: dependency coastline-build-libgmp-for-arm32-beaglebone failed (or also skipped).
libmpfr Skipped View (tail)
Skipped: dependency coastline-build-fdlibm-for-arm32-beaglebone failed (or also skipped).
libpng Skipped View (tail)
Skipped: dependency coastline-build-zlib-for-arm32-beaglebone failed (or also skipped).
python2 Skipped View (tail)
Skipped: dependency coastline-build-fdlibm-for-arm32-beaglebone failed (or also skipped).
libmpc Skipped View (tail)
Skipped: dependency coastline-build-libmpfr-for-arm32-beaglebone failed (or also skipped).
gcc Skipped View (tail)
Skipped: dependency coastline-build-zlib-for-arm32-beaglebone failed (or also skipped).

arm32/gta02(back to top)

Task Result Download Log Duration
HelenOS Failed View (tail) 4 s
The compiler did not produce the output file "probe.s".


/usr/local/cross/arm-linux-gnueabi/libexec/gcc/arm-linux-gnueabi/7.1.0/cc1: error while loading shared libraries: libmpfr.so.4: cannot open shared object file: No such file or directory

######################################################################

/usr/local/cross/arm-linux-gnueabi/libexec/gcc/arm-linux-gnueabi/7.1.0/cc1: error while loading shared libraries: libmpfr.so.4: cannot open shared object file: No such file or directory

make: *** [Makefile:108: Makefile.common] Error 1
binutils Skipped View (tail)
Skipped: dependency coastline-prepare-for-arm32-gta02 failed (or also skipped).
fdlibm Skipped View (tail)
Skipped: dependency coastline-prepare-for-arm32-gta02 failed (or also skipped).
jainja Skipped View (tail)
Skipped: dependency coastline-prepare-for-arm32-gta02 failed (or also skipped).
libgmp Skipped View (tail)
Skipped: dependency coastline-prepare-for-arm32-gta02 failed (or also skipped).
libiconv Skipped View (tail)
Skipped: dependency coastline-prepare-for-arm32-gta02 failed (or also skipped).
msim Skipped View (tail)
Skipped: dependency coastline-prepare-for-arm32-gta02 failed (or also skipped).
pcc Skipped View (tail)
Skipped: dependency coastline-prepare-for-arm32-gta02 failed (or also skipped).
zlib Skipped View (tail)
Skipped: dependency coastline-prepare-for-arm32-gta02 failed (or also skipped).
libisl Skipped View (tail)
Skipped: dependency coastline-build-libgmp-for-arm32-gta02 failed (or also skipped).
libmpfr Skipped View (tail)
Skipped: dependency coastline-build-fdlibm-for-arm32-gta02 failed (or also skipped).
libpng Skipped View (tail)
Skipped: dependency coastline-build-zlib-for-arm32-gta02 failed (or also skipped).
python2 Skipped View (tail)
Skipped: dependency coastline-build-fdlibm-for-arm32-gta02 failed (or also skipped).
libmpc Skipped View (tail)
Skipped: dependency coastline-build-libmpfr-for-arm32-gta02 failed (or also skipped).
gcc Skipped View (tail)
Skipped: dependency coastline-build-zlib-for-arm32-gta02 failed (or also skipped).

arm32/integratorcp(back to top)

Task Result Download Log Duration
HelenOS Failed View (tail) 4 s
The compiler did not produce the output file "probe.s".


/usr/local/cross/arm-linux-gnueabi/libexec/gcc/arm-linux-gnueabi/7.1.0/cc1: error while loading shared libraries: libmpfr.so.4: cannot open shared object file: No such file or directory

######################################################################

/usr/local/cross/arm-linux-gnueabi/libexec/gcc/arm-linux-gnueabi/7.1.0/cc1: error while loading shared libraries: libmpfr.so.4: cannot open shared object file: No such file or directory

make: *** [Makefile:108: Makefile.common] Error 1
binutils Skipped View (tail)
Skipped: dependency coastline-prepare-for-arm32-integratorcp failed (or also skipped).
fdlibm Skipped View (tail)
Skipped: dependency coastline-prepare-for-arm32-integratorcp failed (or also skipped).
jainja Skipped View (tail)
Skipped: dependency coastline-prepare-for-arm32-integratorcp failed (or also skipped).
libgmp Skipped View (tail)
Skipped: dependency coastline-prepare-for-arm32-integratorcp failed (or also skipped).
libiconv Skipped View (tail)
Skipped: dependency coastline-prepare-for-arm32-integratorcp failed (or also skipped).
msim Skipped View (tail)
Skipped: dependency coastline-prepare-for-arm32-integratorcp failed (or also skipped).
pcc Skipped View (tail)
Skipped: dependency coastline-prepare-for-arm32-integratorcp failed (or also skipped).
zlib Skipped View (tail)
Skipped: dependency coastline-prepare-for-arm32-integratorcp failed (or also skipped).
libisl Skipped View (tail)
Skipped: dependency coastline-build-libgmp-for-arm32-integratorcp failed (or also skipped).
libmpfr Skipped View (tail)
Skipped: dependency coastline-build-fdlibm-for-arm32-integratorcp failed (or also skipped).
libpng Skipped View (tail)
Skipped: dependency coastline-build-zlib-for-arm32-integratorcp failed (or also skipped).
python2 Skipped View (tail)
Skipped: dependency coastline-build-fdlibm-for-arm32-integratorcp failed (or also skipped).
libmpc Skipped View (tail)
Skipped: dependency coastline-build-libmpfr-for-arm32-integratorcp failed (or also skipped).
gcc Skipped View (tail)
Skipped: dependency coastline-build-zlib-for-arm32-integratorcp failed (or also skipped).
HelenOS with libmpc Skipped View (tail)
Skipped: dependency helenos-build-arm32-integratorcp failed (or also skipped).
HelenOS with python2 Skipped View (tail)
Skipped: dependency helenos-build-arm32-integratorcp failed (or also skipped).
HelenOS with zlib Skipped View (tail)
Skipped: dependency helenos-build-arm32-integratorcp failed (or also skipped).
HelenOS with libisl Skipped View (tail)
Skipped: dependency helenos-build-arm32-integratorcp failed (or also skipped).
HelenOS with libmpfr Skipped View (tail)
Skipped: dependency helenos-build-arm32-integratorcp failed (or also skipped).
HelenOS with gcc Skipped View (tail)
Skipped: dependency helenos-build-arm32-integratorcp failed (or also skipped).
HelenOS with binutils,pcc Skipped View (tail)
Skipped: dependency helenos-build-arm32-integratorcp failed (or also skipped).
HelenOS with pcc Skipped View (tail)
Skipped: dependency helenos-build-arm32-integratorcp failed (or also skipped).
HelenOS with libgmp Skipped View (tail)
Skipped: dependency helenos-build-arm32-integratorcp failed (or also skipped).
HelenOS with libiconv Skipped View (tail)
Skipped: dependency helenos-build-arm32-integratorcp failed (or also skipped).
HelenOS with libpng Skipped View (tail)
Skipped: dependency helenos-build-arm32-integratorcp failed (or also skipped).
coast/libmpc/smoke.test Skipped View (tail)
Skipped: dependency extra-arm32-integratorcp-with-libmpc failed (or also skipped).
coast/python2/hello.test Skipped View (tail)
Skipped: dependency extra-arm32-integratorcp-with-python2 failed (or also skipped).
coast/python2/version.test Skipped View (tail)
Skipped: dependency extra-arm32-integratorcp-with-python2 failed (or also skipped).
coast/zlib/minigzip.test Skipped View (tail)
Skipped: dependency extra-arm32-integratorcp-with-zlib failed (or also skipped).
coast/libisl/smoke.test Skipped View (tail)
Skipped: dependency extra-arm32-integratorcp-with-libisl failed (or also skipped).
coast/libmpfr/smoke.test Skipped View (tail)
Skipped: dependency extra-arm32-integratorcp-with-libmpfr failed (or also skipped).
coast/gcc/version.test Skipped View (tail)
Skipped: dependency extra-arm32-integratorcp-with-gcc failed (or also skipped).
coast/pcc/hello.test Skipped View (tail)
Skipped: dependency extra-arm32-integratorcp-with-binutils-pcc failed (or also skipped).
coast/pcc/version.test Skipped View (tail)
Skipped: dependency extra-arm32-integratorcp-with-pcc failed (or also skipped).
coast/libgmp/smoke.test Skipped View (tail)
Skipped: dependency extra-arm32-integratorcp-with-libgmp failed (or also skipped).
coast/libiconv/version.test Skipped View (tail)
Skipped: dependency extra-arm32-integratorcp-with-libiconv failed (or also skipped).
coast/libpng/pngtest.test Skipped View (tail)
Skipped: dependency extra-arm32-integratorcp-with-libpng failed (or also skipped).
base/fs.test Skipped View (tail)
Skipped: dependency helenos-build-arm32-integratorcp failed (or also skipped).
base/tester_malloc1.test Skipped View (tail)
Skipped: dependency helenos-build-arm32-integratorcp failed (or also skipped).
boot.test Skipped View (tail)
Skipped: dependency helenos-build-arm32-integratorcp failed (or also skipped).

arm32/raspberrypi(back to top)

Task Result Download Log Duration
HelenOS Failed View (tail) 5 s
The compiler did not produce the output file "probe.s".


/usr/local/cross/arm-linux-gnueabi/libexec/gcc/arm-linux-gnueabi/7.1.0/cc1: error while loading shared libraries: libmpfr.so.4: cannot open shared object file: No such file or directory

######################################################################

/usr/local/cross/arm-linux-gnueabi/libexec/gcc/arm-linux-gnueabi/7.1.0/cc1: error while loading shared libraries: libmpfr.so.4: cannot open shared object file: No such file or directory

make: *** [Makefile:108: Makefile.common] Error 1
binutils Skipped View (tail)
Skipped: dependency coastline-prepare-for-arm32-raspberrypi failed (or also skipped).
fdlibm Skipped View (tail)
Skipped: dependency coastline-prepare-for-arm32-raspberrypi failed (or also skipped).
jainja Skipped View (tail)
Skipped: dependency coastline-prepare-for-arm32-raspberrypi failed (or also skipped).
libgmp Skipped View (tail)
Skipped: dependency coastline-prepare-for-arm32-raspberrypi failed (or also skipped).
libiconv Skipped View (tail)
Skipped: dependency coastline-prepare-for-arm32-raspberrypi failed (or also skipped).
msim Skipped View (tail)
Skipped: dependency coastline-prepare-for-arm32-raspberrypi failed (or also skipped).
pcc Skipped View (tail)
Skipped: dependency coastline-prepare-for-arm32-raspberrypi failed (or also skipped).
zlib Skipped View (tail)
Skipped: dependency coastline-prepare-for-arm32-raspberrypi failed (or also skipped).
libisl Skipped View (tail)
Skipped: dependency coastline-build-libgmp-for-arm32-raspberrypi failed (or also skipped).
libmpfr Skipped View (tail)
Skipped: dependency coastline-build-fdlibm-for-arm32-raspberrypi failed (or also skipped).
libpng Skipped View (tail)
Skipped: dependency coastline-build-zlib-for-arm32-raspberrypi failed (or also skipped).
python2 Skipped View (tail)
Skipped: dependency coastline-build-fdlibm-for-arm32-raspberrypi failed (or also skipped).
libmpc Skipped View (tail)
Skipped: dependency coastline-build-libmpfr-for-arm32-raspberrypi failed (or also skipped).
gcc Skipped View (tail)
Skipped: dependency coastline-build-zlib-for-arm32-raspberrypi failed (or also skipped).

ia32(back to top)

Task Result Download Log Duration
HelenOS Failed View (tail) 6 s
The compiler did not produce the output file "probe.s".


/usr/local/cross/i686-pc-linux-gnu/libexec/gcc/i686-pc-linux-gnu/7.1.0/cc1: error while loading shared libraries: libmpfr.so.4: cannot open shared object file: No such file or directory

######################################################################

/usr/local/cross/i686-pc-linux-gnu/libexec/gcc/i686-pc-linux-gnu/7.1.0/cc1: error while loading shared libraries: libmpfr.so.4: cannot open shared object file: No such file or directory

make: *** [Makefile:108: Makefile.common] Error 1
binutils Skipped View (tail)
Skipped: dependency coastline-prepare-for-ia32 failed (or also skipped).
fdlibm Skipped View (tail)
Skipped: dependency coastline-prepare-for-ia32 failed (or also skipped).
jainja Skipped View (tail)
Skipped: dependency coastline-prepare-for-ia32 failed (or also skipped).
libgmp Skipped View (tail)
Skipped: dependency coastline-prepare-for-ia32 failed (or also skipped).
libiconv Skipped View (tail)
Skipped: dependency coastline-prepare-for-ia32 failed (or also skipped).
msim Skipped View (tail)
Skipped: dependency coastline-prepare-for-ia32 failed (or also skipped).
pcc Skipped View (tail)
Skipped: dependency coastline-prepare-for-ia32 failed (or also skipped).
zlib Skipped View (tail)
Skipped: dependency coastline-prepare-for-ia32 failed (or also skipped).
libisl Skipped View (tail)
Skipped: dependency coastline-build-libgmp-for-ia32 failed (or also skipped).
libmpfr Skipped View (tail)
Skipped: dependency coastline-build-fdlibm-for-ia32 failed (or also skipped).
libpng Skipped View (tail)
Skipped: dependency coastline-build-zlib-for-ia32 failed (or also skipped).
python2 Skipped View (tail)
Skipped: dependency coastline-build-fdlibm-for-ia32 failed (or also skipped).
libmpc Skipped View (tail)
Skipped: dependency coastline-build-libmpfr-for-ia32 failed (or also skipped).
gcc Skipped View (tail)
Skipped: dependency coastline-build-zlib-for-ia32 failed (or also skipped).
HelenOS with libmpc Skipped View (tail)
Skipped: dependency helenos-build-ia32 failed (or also skipped).
HelenOS with python2 Skipped View (tail)
Skipped: dependency helenos-build-ia32 failed (or also skipped).
HelenOS with zlib Skipped View (tail)
Skipped: dependency helenos-build-ia32 failed (or also skipped).
HelenOS with libisl Skipped View (tail)
Skipped: dependency helenos-build-ia32 failed (or also skipped).
HelenOS with libmpfr Skipped View (tail)
Skipped: dependency helenos-build-ia32 failed (or also skipped).
HelenOS with gcc Skipped View (tail)
Skipped: dependency helenos-build-ia32 failed (or also skipped).
HelenOS with binutils,pcc Skipped View (tail)
Skipped: dependency helenos-build-ia32 failed (or also skipped).
HelenOS with pcc Skipped View (tail)
Skipped: dependency helenos-build-ia32 failed (or also skipped).
HelenOS with libgmp Skipped View (tail)
Skipped: dependency helenos-build-ia32 failed (or also skipped).
HelenOS with libiconv Skipped View (tail)
Skipped: dependency helenos-build-ia32 failed (or also skipped).
HelenOS with libpng Skipped View (tail)
Skipped: dependency helenos-build-ia32 failed (or also skipped).
coast/libmpc/smoke.test Skipped View (tail)
Skipped: dependency extra-ia32-with-libmpc failed (or also skipped).
coast/python2/hello.test Skipped View (tail)
Skipped: dependency extra-ia32-with-python2 failed (or also skipped).
coast/python2/version.test Skipped View (tail)
Skipped: dependency extra-ia32-with-python2 failed (or also skipped).
coast/zlib/minigzip.test Skipped View (tail)
Skipped: dependency extra-ia32-with-zlib failed (or also skipped).
coast/libisl/smoke.test Skipped View (tail)
Skipped: dependency extra-ia32-with-libisl failed (or also skipped).
coast/libmpfr/smoke.test Skipped View (tail)
Skipped: dependency extra-ia32-with-libmpfr failed (or also skipped).
coast/gcc/version.test Skipped View (tail)
Skipped: dependency extra-ia32-with-gcc failed (or also skipped).
coast/pcc/hello.test Skipped View (tail)
Skipped: dependency extra-ia32-with-binutils-pcc failed (or also skipped).
coast/pcc/version.test Skipped View (tail)
Skipped: dependency extra-ia32-with-pcc failed (or also skipped).
coast/libgmp/smoke.test Skipped View (tail)
Skipped: dependency extra-ia32-with-libgmp failed (or also skipped).
coast/libiconv/version.test Skipped View (tail)
Skipped: dependency extra-ia32-with-libiconv failed (or also skipped).
coast/libpng/pngtest.test Skipped View (tail)
Skipped: dependency extra-ia32-with-libpng failed (or also skipped).
base/fs.test Skipped View (tail)
Skipped: dependency helenos-build-ia32 failed (or also skipped).
base/tester_malloc1.test Skipped View (tail)
Skipped: dependency helenos-build-ia32 failed (or also skipped).
boot.test Skipped View (tail)
Skipped: dependency helenos-build-ia32 failed (or also skipped).

ia64/i460GX(back to top)

Task Result Download Log Duration
HelenOS Failed View (tail) 5 s
The compiler did not produce the output file "probe.s".


/usr/local/cross/ia64-pc-linux-gnu/libexec/gcc/ia64-pc-linux-gnu/7.1.0/cc1: error while loading shared libraries: libmpfr.so.4: cannot open shared object file: No such file or directory

######################################################################

/usr/local/cross/ia64-pc-linux-gnu/libexec/gcc/ia64-pc-linux-gnu/7.1.0/cc1: error while loading shared libraries: libmpfr.so.4: cannot open shared object file: No such file or directory

make: *** [Makefile:108: Makefile.common] Error 1
binutils Skipped View (tail)
Skipped: dependency coastline-prepare-for-ia64-i460GX failed (or also skipped).
fdlibm Skipped View (tail)
Skipped: dependency coastline-prepare-for-ia64-i460GX failed (or also skipped).
jainja Skipped View (tail)
Skipped: dependency coastline-prepare-for-ia64-i460GX failed (or also skipped).
libgmp Skipped View (tail)
Skipped: dependency coastline-prepare-for-ia64-i460GX failed (or also skipped).
libiconv Skipped View (tail)
Skipped: dependency coastline-prepare-for-ia64-i460GX failed (or also skipped).
msim Skipped View (tail)
Skipped: dependency coastline-prepare-for-ia64-i460GX failed (or also skipped).
pcc Skipped View (tail)
Skipped: dependency coastline-prepare-for-ia64-i460GX failed (or also skipped).
zlib Skipped View (tail)
Skipped: dependency coastline-prepare-for-ia64-i460GX failed (or also skipped).
libisl Skipped View (tail)
Skipped: dependency coastline-build-libgmp-for-ia64-i460GX failed (or also skipped).
libmpfr Skipped View (tail)
Skipped: dependency coastline-build-fdlibm-for-ia64-i460GX failed (or also skipped).
libpng Skipped View (tail)
Skipped: dependency coastline-build-zlib-for-ia64-i460GX failed (or also skipped).
python2 Skipped View (tail)
Skipped: dependency coastline-build-fdlibm-for-ia64-i460GX failed (or also skipped).
libmpc Skipped View (tail)
Skipped: dependency coastline-build-libmpfr-for-ia64-i460GX failed (or also skipped).
gcc Skipped View (tail)
Skipped: dependency coastline-build-zlib-for-ia64-i460GX failed (or also skipped).

ia64/ski(back to top)

Task Result Download Log Duration
HelenOS Failed View (tail) 4 s
The compiler did not produce the output file "probe.s".


/usr/local/cross/ia64-pc-linux-gnu/libexec/gcc/ia64-pc-linux-gnu/7.1.0/cc1: error while loading shared libraries: libmpfr.so.4: cannot open shared object file: No such file or directory

######################################################################

/usr/local/cross/ia64-pc-linux-gnu/libexec/gcc/ia64-pc-linux-gnu/7.1.0/cc1: error while loading shared libraries: libmpfr.so.4: cannot open shared object file: No such file or directory

make: *** [Makefile:108: Makefile.common] Error 1
binutils Skipped View (tail)
Skipped: dependency coastline-prepare-for-ia64-ski failed (or also skipped).
fdlibm Skipped View (tail)
Skipped: dependency coastline-prepare-for-ia64-ski failed (or also skipped).
jainja Skipped View (tail)
Skipped: dependency coastline-prepare-for-ia64-ski failed (or also skipped).
libgmp Skipped View (tail)
Skipped: dependency coastline-prepare-for-ia64-ski failed (or also skipped).
libiconv Skipped View (tail)
Skipped: dependency coastline-prepare-for-ia64-ski failed (or also skipped).
msim Skipped View (tail)
Skipped: dependency coastline-prepare-for-ia64-ski failed (or also skipped).
pcc Skipped View (tail)
Skipped: dependency coastline-prepare-for-ia64-ski failed (or also skipped).
zlib Skipped View (tail)
Skipped: dependency coastline-prepare-for-ia64-ski failed (or also skipped).
libisl Skipped View (tail)
Skipped: dependency coastline-build-libgmp-for-ia64-ski failed (or also skipped).
libmpfr Skipped View (tail)
Skipped: dependency coastline-build-fdlibm-for-ia64-ski failed (or also skipped).
libpng Skipped View (tail)
Skipped: dependency coastline-build-zlib-for-ia64-ski failed (or also skipped).
python2 Skipped View (tail)
Skipped: dependency coastline-build-fdlibm-for-ia64-ski failed (or also skipped).
libmpc Skipped View (tail)
Skipped: dependency coastline-build-libmpfr-for-ia64-ski failed (or also skipped).
gcc Skipped View (tail)
Skipped: dependency coastline-build-zlib-for-ia64-ski failed (or also skipped).

mips32/malta-be(back to top)

Task Result Download Log Duration
HelenOS Failed View (tail) 5 s
The compiler did not produce the output file "probe.s".


/usr/local/cross/mips-linux-gnu/libexec/gcc/mips-linux-gnu/7.1.0/cc1: error while loading shared libraries: libmpfr.so.4: cannot open shared object file: No such file or directory

######################################################################

/usr/local/cross/mips-linux-gnu/libexec/gcc/mips-linux-gnu/7.1.0/cc1: error while loading shared libraries: libmpfr.so.4: cannot open shared object file: No such file or directory

make: *** [Makefile:108: Makefile.common] Error 1
binutils Skipped View (tail)
Skipped: dependency coastline-prepare-for-mips32-malta-be failed (or also skipped).
fdlibm Skipped View (tail)
Skipped: dependency coastline-prepare-for-mips32-malta-be failed (or also skipped).
jainja Skipped View (tail)
Skipped: dependency coastline-prepare-for-mips32-malta-be failed (or also skipped).
libgmp Skipped View (tail)
Skipped: dependency coastline-prepare-for-mips32-malta-be failed (or also skipped).
libiconv Skipped View (tail)
Skipped: dependency coastline-prepare-for-mips32-malta-be failed (or also skipped).
msim Skipped View (tail)
Skipped: dependency coastline-prepare-for-mips32-malta-be failed (or also skipped).
pcc Skipped View (tail)
Skipped: dependency coastline-prepare-for-mips32-malta-be failed (or also skipped).
zlib Skipped View (tail)
Skipped: dependency coastline-prepare-for-mips32-malta-be failed (or also skipped).
libisl Skipped View (tail)
Skipped: dependency coastline-build-libgmp-for-mips32-malta-be failed (or also skipped).
libmpfr Skipped View (tail)
Skipped: dependency coastline-build-fdlibm-for-mips32-malta-be failed (or also skipped).
libpng Skipped View (tail)
Skipped: dependency coastline-build-zlib-for-mips32-malta-be failed (or also skipped).
python2 Skipped View (tail)
Skipped: dependency coastline-build-fdlibm-for-mips32-malta-be failed (or also skipped).
libmpc Skipped View (tail)
Skipped: dependency coastline-build-libmpfr-for-mips32-malta-be failed (or also skipped).
gcc Skipped View (tail)
Skipped: dependency coastline-build-zlib-for-mips32-malta-be failed (or also skipped).

mips32/malta-le(back to top)

Task Result Download Log Duration
HelenOS Failed View (tail) 7 s
The compiler did not produce the output file "probe.s".


/usr/local/cross/mipsel-linux-gnu/libexec/gcc/mipsel-linux-gnu/7.1.0/cc1: error while loading shared libraries: libmpfr.so.4: cannot open shared object file: No such file or directory

######################################################################

/usr/local/cross/mipsel-linux-gnu/libexec/gcc/mipsel-linux-gnu/7.1.0/cc1: error while loading shared libraries: libmpfr.so.4: cannot open shared object file: No such file or directory

make: *** [Makefile:108: Makefile.common] Error 1
binutils Skipped View (tail)
Skipped: dependency coastline-prepare-for-mips32-malta-le failed (or also skipped).
fdlibm Skipped View (tail)
Skipped: dependency coastline-prepare-for-mips32-malta-le failed (or also skipped).
jainja Skipped View (tail)
Skipped: dependency coastline-prepare-for-mips32-malta-le failed (or also skipped).
libgmp Skipped View (tail)
Skipped: dependency coastline-prepare-for-mips32-malta-le failed (or also skipped).
libiconv Skipped View (tail)
Skipped: dependency coastline-prepare-for-mips32-malta-le failed (or also skipped).
msim Skipped View (tail)
Skipped: dependency coastline-prepare-for-mips32-malta-le failed (or also skipped).
pcc Skipped View (tail)
Skipped: dependency coastline-prepare-for-mips32-malta-le failed (or also skipped).
zlib Skipped View (tail)
Skipped: dependency coastline-prepare-for-mips32-malta-le failed (or also skipped).
libisl Skipped View (tail)
Skipped: dependency coastline-build-libgmp-for-mips32-malta-le failed (or also skipped).
libmpfr Skipped View (tail)
Skipped: dependency coastline-build-fdlibm-for-mips32-malta-le failed (or also skipped).
libpng Skipped View (tail)
Skipped: dependency coastline-build-zlib-for-mips32-malta-le failed (or also skipped).
python2 Skipped View (tail)
Skipped: dependency coastline-build-fdlibm-for-mips32-malta-le failed (or also skipped).
libmpc Skipped View (tail)
Skipped: dependency coastline-build-libmpfr-for-mips32-malta-le failed (or also skipped).
gcc Skipped View (tail)
Skipped: dependency coastline-build-zlib-for-mips32-malta-le failed (or also skipped).

mips32/msim(back to top)

Task Result Download Log Duration
HelenOS Failed View (tail) 5 s
The compiler did not produce the output file "probe.s".


/usr/local/cross/mipsel-linux-gnu/libexec/gcc/mipsel-linux-gnu/7.1.0/cc1: error while loading shared libraries: libmpfr.so.4: cannot open shared object file: No such file or directory

######################################################################

/usr/local/cross/mipsel-linux-gnu/libexec/gcc/mipsel-linux-gnu/7.1.0/cc1: error while loading shared libraries: libmpfr.so.4: cannot open shared object file: No such file or directory

make: *** [Makefile:108: Makefile.common] Error 1
binutils Skipped View (tail)
Skipped: dependency coastline-prepare-for-mips32-msim failed (or also skipped).
fdlibm Skipped View (tail)
Skipped: dependency coastline-prepare-for-mips32-msim failed (or also skipped).
jainja Skipped View (tail)
Skipped: dependency coastline-prepare-for-mips32-msim failed (or also skipped).
libgmp Skipped View (tail)
Skipped: dependency coastline-prepare-for-mips32-msim failed (or also skipped).
libiconv Skipped View (tail)
Skipped: dependency coastline-prepare-for-mips32-msim failed (or also skipped).
msim Skipped View (tail)
Skipped: dependency coastline-prepare-for-mips32-msim failed (or also skipped).
pcc Skipped View (tail)
Skipped: dependency coastline-prepare-for-mips32-msim failed (or also skipped).
zlib Skipped View (tail)
Skipped: dependency coastline-prepare-for-mips32-msim failed (or also skipped).
libisl Skipped View (tail)
Skipped: dependency coastline-build-libgmp-for-mips32-msim failed (or also skipped).
libmpfr Skipped View (tail)
Skipped: dependency coastline-build-fdlibm-for-mips32-msim failed (or also skipped).
libpng Skipped View (tail)
Skipped: dependency coastline-build-zlib-for-mips32-msim failed (or also skipped).
python2 Skipped View (tail)
Skipped: dependency coastline-build-fdlibm-for-mips32-msim failed (or also skipped).
libmpc Skipped View (tail)
Skipped: dependency coastline-build-libmpfr-for-mips32-msim failed (or also skipped).
gcc Skipped View (tail)
Skipped: dependency coastline-build-zlib-for-mips32-msim failed (or also skipped).

ppc32(back to top)

Task Result Download Log Duration
HelenOS Failed View (tail) 6 s
The compiler did not produce the output file "probe.s".


/usr/local/cross/ppc-linux-gnu/libexec/gcc/ppc-linux-gnu/7.1.0/cc1: error while loading shared libraries: libmpfr.so.4: cannot open shared object file: No such file or directory

######################################################################

/usr/local/cross/ppc-linux-gnu/libexec/gcc/ppc-linux-gnu/7.1.0/cc1: error while loading shared libraries: libmpfr.so.4: cannot open shared object file: No such file or directory

make: *** [Makefile:108: Makefile.common] Error 1
binutils Skipped View (tail)
Skipped: dependency coastline-prepare-for-ppc32 failed (or also skipped).
fdlibm Skipped View (tail)
Skipped: dependency coastline-prepare-for-ppc32 failed (or also skipped).
jainja Skipped View (tail)
Skipped: dependency coastline-prepare-for-ppc32 failed (or also skipped).
libgmp Skipped View (tail)
Skipped: dependency coastline-prepare-for-ppc32 failed (or also skipped).
libiconv Skipped View (tail)
Skipped: dependency coastline-prepare-for-ppc32 failed (or also skipped).
msim Skipped View (tail)
Skipped: dependency coastline-prepare-for-ppc32 failed (or also skipped).
pcc Skipped View (tail)
Skipped: dependency coastline-prepare-for-ppc32 failed (or also skipped).
zlib Skipped View (tail)
Skipped: dependency coastline-prepare-for-ppc32 failed (or also skipped).
libisl Skipped View (tail)
Skipped: dependency coastline-build-libgmp-for-ppc32 failed (or also skipped).
libmpfr Skipped View (tail)
Skipped: dependency coastline-build-fdlibm-for-ppc32 failed (or also skipped).
libpng Skipped View (tail)
Skipped: dependency coastline-build-zlib-for-ppc32 failed (or also skipped).
python2 Skipped View (tail)
Skipped: dependency coastline-build-fdlibm-for-ppc32 failed (or also skipped).
libmpc Skipped View (tail)
Skipped: dependency coastline-build-libmpfr-for-ppc32 failed (or also skipped).
gcc Skipped View (tail)
Skipped: dependency coastline-build-zlib-for-ppc32 failed (or also skipped).
HelenOS with libmpc Skipped View (tail)
Skipped: dependency helenos-build-ppc32 failed (or also skipped).
HelenOS with python2 Skipped View (tail)
Skipped: dependency helenos-build-ppc32 failed (or also skipped).
HelenOS with zlib Skipped View (tail)
Skipped: dependency helenos-build-ppc32 failed (or also skipped).
HelenOS with libisl Skipped View (tail)
Skipped: dependency helenos-build-ppc32 failed (or also skipped).
HelenOS with libmpfr Skipped View (tail)
Skipped: dependency helenos-build-ppc32 failed (or also skipped).
HelenOS with gcc Skipped View (tail)
Skipped: dependency helenos-build-ppc32 failed (or also skipped).
HelenOS with binutils,pcc Skipped View (tail)
Skipped: dependency helenos-build-ppc32 failed (or also skipped).
HelenOS with pcc Skipped View (tail)
Skipped: dependency helenos-build-ppc32 failed (or also skipped).
HelenOS with libgmp Skipped View (tail)
Skipped: dependency helenos-build-ppc32 failed (or also skipped).
HelenOS with libiconv Skipped View (tail)
Skipped: dependency helenos-build-ppc32 failed (or also skipped).
HelenOS with libpng Skipped View (tail)
Skipped: dependency helenos-build-ppc32 failed (or also skipped).
coast/libmpc/smoke.test Skipped View (tail)
Skipped: dependency extra-ppc32-with-libmpc failed (or also skipped).
coast/python2/hello.test Skipped View (tail)
Skipped: dependency extra-ppc32-with-python2 failed (or also skipped).
coast/python2/version.test Skipped View (tail)
Skipped: dependency extra-ppc32-with-python2 failed (or also skipped).
coast/zlib/minigzip.test Skipped View (tail)
Skipped: dependency extra-ppc32-with-zlib failed (or also skipped).
coast/libisl/smoke.test Skipped View (tail)
Skipped: dependency extra-ppc32-with-libisl failed (or also skipped).
coast/libmpfr/smoke.test Skipped View (tail)
Skipped: dependency extra-ppc32-with-libmpfr failed (or also skipped).
coast/gcc/version.test Skipped View (tail)
Skipped: dependency extra-ppc32-with-gcc failed (or also skipped).
coast/pcc/hello.test Skipped View (tail)
Skipped: dependency extra-ppc32-with-binutils-pcc failed (or also skipped).
coast/pcc/version.test Skipped View (tail)
Skipped: dependency extra-ppc32-with-pcc failed (or also skipped).
coast/libgmp/smoke.test Skipped View (tail)
Skipped: dependency extra-ppc32-with-libgmp failed (or also skipped).
coast/libiconv/version.test Skipped View (tail)
Skipped: dependency extra-ppc32-with-libiconv failed (or also skipped).
coast/libpng/pngtest.test Skipped View (tail)
Skipped: dependency extra-ppc32-with-libpng failed (or also skipped).
base/fs.test Skipped View (tail)
Skipped: dependency helenos-build-ppc32 failed (or also skipped).
base/tester_malloc1.test Skipped View (tail)
Skipped: dependency helenos-build-ppc32 failed (or also skipped).
boot.test Skipped View (tail)
Skipped: dependency helenos-build-ppc32 failed (or also skipped).

sparc64/niagara(back to top)

Task Result Download Log Duration
HelenOS Failed View (tail) 7 s
The compiler did not produce the output file "probe.s".


/usr/local/cross/sparc64-linux-gnu/libexec/gcc/sparc64-linux-gnu/7.1.0/cc1: error while loading shared libraries: libmpfr.so.4: cannot open shared object file: No such file or directory

######################################################################

/usr/local/cross/sparc64-linux-gnu/libexec/gcc/sparc64-linux-gnu/7.1.0/cc1: error while loading shared libraries: libmpfr.so.4: cannot open shared object file: No such file or directory

make: *** [Makefile:108: Makefile.common] Error 1
binutils Skipped View (tail)
Skipped: dependency coastline-prepare-for-sparc64-niagara failed (or also skipped).
fdlibm Skipped View (tail)
Skipped: dependency coastline-prepare-for-sparc64-niagara failed (or also skipped).
jainja Skipped View (tail)
Skipped: dependency coastline-prepare-for-sparc64-niagara failed (or also skipped).
libgmp Skipped View (tail)
Skipped: dependency coastline-prepare-for-sparc64-niagara failed (or also skipped).
libiconv Skipped View (tail)
Skipped: dependency coastline-prepare-for-sparc64-niagara failed (or also skipped).
msim Skipped View (tail)
Skipped: dependency coastline-prepare-for-sparc64-niagara failed (or also skipped).
pcc Skipped View (tail)
Skipped: dependency coastline-prepare-for-sparc64-niagara failed (or also skipped).
zlib Skipped View (tail)
Skipped: dependency coastline-prepare-for-sparc64-niagara failed (or also skipped).
libisl Skipped View (tail)
Skipped: dependency coastline-build-libgmp-for-sparc64-niagara failed (or also skipped).
libmpfr Skipped View (tail)
Skipped: dependency coastline-build-fdlibm-for-sparc64-niagara failed (or also skipped).
libpng Skipped View (tail)
Skipped: dependency coastline-build-zlib-for-sparc64-niagara failed (or also skipped).
python2 Skipped View (tail)
Skipped: dependency coastline-build-fdlibm-for-sparc64-niagara failed (or also skipped).
libmpc Skipped View (tail)
Skipped: dependency coastline-build-libmpfr-for-sparc64-niagara failed (or also skipped).
gcc Skipped View (tail)
Skipped: dependency coastline-build-zlib-for-sparc64-niagara failed (or also skipped).

sparc64/ultra(back to top)

Task Result Download Log Duration
HelenOS Failed View (tail) 4 s
The compiler did not produce the output file "probe.s".


/usr/local/cross/sparc64-linux-gnu/libexec/gcc/sparc64-linux-gnu/7.1.0/cc1: error while loading shared libraries: libmpfr.so.4: cannot open shared object file: No such file or directory

######################################################################

/usr/local/cross/sparc64-linux-gnu/libexec/gcc/sparc64-linux-gnu/7.1.0/cc1: error while loading shared libraries: libmpfr.so.4: cannot open shared object file: No such file or directory

make: *** [Makefile:108: Makefile.common] Error 1
binutils Skipped View (tail)
Skipped: dependency coastline-prepare-for-sparc64-ultra failed (or also skipped).
fdlibm Skipped View (tail)
Skipped: dependency coastline-prepare-for-sparc64-ultra failed (or also skipped).
jainja Skipped View (tail)
Skipped: dependency coastline-prepare-for-sparc64-ultra failed (or also skipped).
libgmp Skipped View (tail)
Skipped: dependency coastline-prepare-for-sparc64-ultra failed (or also skipped).
libiconv Skipped View (tail)
Skipped: dependency coastline-prepare-for-sparc64-ultra failed (or also skipped).
msim Skipped View (tail)
Skipped: dependency coastline-prepare-for-sparc64-ultra failed (or also skipped).
pcc Skipped View (tail)
Skipped: dependency coastline-prepare-for-sparc64-ultra failed (or also skipped).
zlib Skipped View (tail)
Skipped: dependency coastline-prepare-for-sparc64-ultra failed (or also skipped).
libisl Skipped View (tail)
Skipped: dependency coastline-build-libgmp-for-sparc64-ultra failed (or also skipped).
libmpfr Skipped View (tail)
Skipped: dependency coastline-build-fdlibm-for-sparc64-ultra failed (or also skipped).
libpng Skipped View (tail)
Skipped: dependency coastline-build-zlib-for-sparc64-ultra failed (or also skipped).
python2 Skipped View (tail)
Skipped: dependency coastline-build-fdlibm-for-sparc64-ultra failed (or also skipped).
libmpc Skipped View (tail)
Skipped: dependency coastline-build-libmpfr-for-sparc64-ultra failed (or also skipped).
gcc Skipped View (tail)
Skipped: dependency coastline-build-zlib-for-sparc64-ultra failed (or also skipped).

special/abs32le(back to top)

Task Result Download Log Duration
HelenOS Failed View (tail) 7 s
The compiler did not produce the output file "probe.s".


/usr/local/cross/i686-pc-linux-gnu/libexec/gcc/i686-pc-linux-gnu/7.1.0/cc1: error while loading shared libraries: libmpfr.so.4: cannot open shared object file: No such file or directory

######################################################################

/usr/local/cross/i686-pc-linux-gnu/libexec/gcc/i686-pc-linux-gnu/7.1.0/cc1: error while loading shared libraries: libmpfr.so.4: cannot open shared object file: No such file or directory

make: *** [Makefile:108: Makefile.common] Error 1

Per-harbour details(back to top)

binutils(back to top)

Architecture Result Download Log Duration
Tarball fetch OK View (tail) 6 s
 18250K .......... .......... .......... .......... .......... 98% 25.2M 0s
 18300K .......... .......... .......... .......... .......... 98% 35.4M 0s
 18350K .......... .......... .......... .......... .......... 99% 21.4M 0s
 18400K .......... .......... .......... .......... .......... 99% 1.58M 0s
 18450K .......... .......... .......... .......... .......... 99%  811K 0s
 18500K .......... .......... .......... .......... .......... 99% 21.1M 0s
 18550K ..                                                    100% 4759G=3.9s

2018-01-25 01:15:19 (4.70 MB/s) - ‘/var/lib/helenos-ci/nightly/tmp-ci/mirror/sources/binutils-2.21.1.tar.bz2’ saved [18997755]

amd64 Skipped View (tail)
Skipped: dependency coastline-prepare-for-amd64 failed (or also skipped).
arm32/beagleboardxm Skipped View (tail)
Skipped: dependency coastline-prepare-for-arm32-beagleboardxm failed (or also skipped).
arm32/beaglebone Skipped View (tail)
Skipped: dependency coastline-prepare-for-arm32-beaglebone failed (or also skipped).
arm32/gta02 Skipped View (tail)
Skipped: dependency coastline-prepare-for-arm32-gta02 failed (or also skipped).
arm32/integratorcp Skipped View (tail)
Skipped: dependency coastline-prepare-for-arm32-integratorcp failed (or also skipped).
arm32/raspberrypi Skipped View (tail)
Skipped: dependency coastline-prepare-for-arm32-raspberrypi failed (or also skipped).
ia32 Skipped View (tail)
Skipped: dependency coastline-prepare-for-ia32 failed (or also skipped).
ia64/i460GX Skipped View (tail)
Skipped: dependency coastline-prepare-for-ia64-i460GX failed (or also skipped).
ia64/ski Skipped View (tail)
Skipped: dependency coastline-prepare-for-ia64-ski failed (or also skipped).
mips32/malta-be Skipped View (tail)
Skipped: dependency coastline-prepare-for-mips32-malta-be failed (or also skipped).
mips32/malta-le Skipped View (tail)
Skipped: dependency coastline-prepare-for-mips32-malta-le failed (or also skipped).
mips32/msim Skipped View (tail)
Skipped: dependency coastline-prepare-for-mips32-msim failed (or also skipped).
ppc32 Skipped View (tail)
Skipped: dependency coastline-prepare-for-ppc32 failed (or also skipped).
sparc64/niagara Skipped View (tail)
Skipped: dependency coastline-prepare-for-sparc64-niagara failed (or also skipped).
sparc64/ultra Skipped View (tail)
Skipped: dependency coastline-prepare-for-sparc64-ultra failed (or also skipped).

fdlibm(back to top)

Architecture Result Download Log Duration
Tarball fetch OK View (tail) 2 s
Connecting to www.validlab.com|209.128.78.139|:80... connected.
HTTP request sent, awaiting response... 200 OK
Length: 99573 (97K) [application/x-gzip]
Saving to: ‘/var/lib/helenos-ci/nightly/tmp-ci/mirror/sources/fdlibm53.tar.gz’

     0K .......... .......... .......... .......... .......... 51%  103K 0s
    50K .......... .......... .......... .......... .......   100%  301K=0.6s

2018-01-25 01:15:15 (152 KB/s) - ‘/var/lib/helenos-ci/nightly/tmp-ci/mirror/sources/fdlibm53.tar.gz’ saved [99573/99573]

amd64 Skipped View (tail)
Skipped: dependency coastline-prepare-for-amd64 failed (or also skipped).
arm32/beagleboardxm Skipped View (tail)
Skipped: dependency coastline-prepare-for-arm32-beagleboardxm failed (or also skipped).
arm32/beaglebone Skipped View (tail)
Skipped: dependency coastline-prepare-for-arm32-beaglebone failed (or also skipped).
arm32/gta02 Skipped View (tail)
Skipped: dependency coastline-prepare-for-arm32-gta02 failed (or also skipped).
arm32/integratorcp Skipped View (tail)
Skipped: dependency coastline-prepare-for-arm32-integratorcp failed (or also skipped).
arm32/raspberrypi Skipped View (tail)
Skipped: dependency coastline-prepare-for-arm32-raspberrypi failed (or also skipped).
ia32 Skipped View (tail)
Skipped: dependency coastline-prepare-for-ia32 failed (or also skipped).
ia64/i460GX Skipped View (tail)
Skipped: dependency coastline-prepare-for-ia64-i460GX failed (or also skipped).
ia64/ski Skipped View (tail)
Skipped: dependency coastline-prepare-for-ia64-ski failed (or also skipped).
mips32/malta-be Skipped View (tail)
Skipped: dependency coastline-prepare-for-mips32-malta-be failed (or also skipped).
mips32/malta-le Skipped View (tail)
Skipped: dependency coastline-prepare-for-mips32-malta-le failed (or also skipped).
mips32/msim Skipped View (tail)
Skipped: dependency coastline-prepare-for-mips32-msim failed (or also skipped).
ppc32 Skipped View (tail)
Skipped: dependency coastline-prepare-for-ppc32 failed (or also skipped).
sparc64/niagara Skipped View (tail)
Skipped: dependency coastline-prepare-for-sparc64-niagara failed (or also skipped).
sparc64/ultra Skipped View (tail)
Skipped: dependency coastline-prepare-for-sparc64-ultra failed (or also skipped).

gcc(back to top)

Architecture Result Download Log Duration
Tarball fetch OK View (tail) 3 s
 70000K .......... .......... .......... .......... .......... 99%  108M 0s
 70050K .......... .......... .......... .......... .......... 99%  109M 0s
 70100K .......... .......... .......... .......... .......... 99% 13.4M 0s
 70150K .......... .......... .......... .......... .......... 99%  109M 0s
 70200K .......... .......... .......... .......... .......... 99%  106M 0s
 70250K .......... .......... .......... .......... .......... 99% 9.60M 0s
 70300K .......... .                                          100%  133M=3.0s

2018-01-25 01:15:27 (23.0 MB/s) - ‘/var/lib/helenos-ci/nightly/tmp-ci/mirror/sources/gcc-4.6.3.tar.bz2’ saved [71999439]

amd64 Skipped View (tail)
Skipped: dependency coastline-build-zlib-for-amd64 failed (or also skipped).
arm32/beagleboardxm Skipped View (tail)
Skipped: dependency coastline-build-zlib-for-arm32-beagleboardxm failed (or also skipped).
arm32/beaglebone Skipped View (tail)
Skipped: dependency coastline-build-zlib-for-arm32-beaglebone failed (or also skipped).
arm32/gta02 Skipped View (tail)
Skipped: dependency coastline-build-zlib-for-arm32-gta02 failed (or also skipped).
arm32/integratorcp Skipped View (tail)
Skipped: dependency coastline-build-zlib-for-arm32-integratorcp failed (or also skipped).
arm32/raspberrypi Skipped View (tail)
Skipped: dependency coastline-build-zlib-for-arm32-raspberrypi failed (or also skipped).
ia32 Skipped View (tail)
Skipped: dependency coastline-build-zlib-for-ia32 failed (or also skipped).
ia64/i460GX Skipped View (tail)
Skipped: dependency coastline-build-zlib-for-ia64-i460GX failed (or also skipped).
ia64/ski Skipped View (tail)
Skipped: dependency coastline-build-zlib-for-ia64-ski failed (or also skipped).
mips32/malta-be Skipped View (tail)
Skipped: dependency coastline-build-zlib-for-mips32-malta-be failed (or also skipped).
mips32/malta-le Skipped View (tail)
Skipped: dependency coastline-build-zlib-for-mips32-malta-le failed (or also skipped).
mips32/msim Skipped View (tail)
Skipped: dependency coastline-build-zlib-for-mips32-msim failed (or also skipped).
ppc32 Skipped View (tail)
Skipped: dependency coastline-build-zlib-for-ppc32 failed (or also skipped).
sparc64/niagara Skipped View (tail)
Skipped: dependency coastline-build-zlib-for-sparc64-niagara failed (or also skipped).
sparc64/ultra Skipped View (tail)
Skipped: dependency coastline-build-zlib-for-sparc64-ultra failed (or also skipped).

jainja(back to top)

Architecture Result Download Log Duration
Tarball fetch OK View (tail) 3 s
  5950K .......... .......... .......... .......... .......... 95%  320M 0s
  6000K .......... .......... .......... .......... .......... 96%  262M 0s
  6050K .......... .......... .......... .......... .......... 97%  329M 0s
  6100K .......... .......... .......... .......... .......... 98% 88.4M 0s
  6150K .......... .......... .......... .......... .......... 99% 21.4M 0s
  6200K .......... .......... .......... .......... .......... 99% 59.4M 0s
  6250K .                                                     100% 3459G=0.8s

2018-01-25 01:15:19 (7.39 MB/s) - ‘/var/lib/helenos-ci/nightly/tmp-ci/mirror/sources/jainja-0.8.tar.gz’ saved [6401857/6401857]

amd64 Skipped View (tail)
Skipped: dependency coastline-prepare-for-amd64 failed (or also skipped).
arm32/beagleboardxm Skipped View (tail)
Skipped: dependency coastline-prepare-for-arm32-beagleboardxm failed (or also skipped).
arm32/beaglebone Skipped View (tail)
Skipped: dependency coastline-prepare-for-arm32-beaglebone failed (or also skipped).
arm32/gta02 Skipped View (tail)
Skipped: dependency coastline-prepare-for-arm32-gta02 failed (or also skipped).
arm32/integratorcp Skipped View (tail)
Skipped: dependency coastline-prepare-for-arm32-integratorcp failed (or also skipped).
arm32/raspberrypi Skipped View (tail)
Skipped: dependency coastline-prepare-for-arm32-raspberrypi failed (or also skipped).
ia32 Skipped View (tail)
Skipped: dependency coastline-prepare-for-ia32 failed (or also skipped).
ia64/i460GX Skipped View (tail)
Skipped: dependency coastline-prepare-for-ia64-i460GX failed (or also skipped).
ia64/ski Skipped View (tail)
Skipped: dependency coastline-prepare-for-ia64-ski failed (or also skipped).
mips32/malta-be Skipped View (tail)
Skipped: dependency coastline-prepare-for-mips32-malta-be failed (or also skipped).
mips32/malta-le Skipped View (tail)
Skipped: dependency coastline-prepare-for-mips32-malta-le failed (or also skipped).
mips32/msim Skipped View (tail)
Skipped: dependency coastline-prepare-for-mips32-msim failed (or also skipped).
ppc32 Skipped View (tail)
Skipped: dependency coastline-prepare-for-ppc32 failed (or also skipped).
sparc64/niagara Skipped View (tail)
Skipped: dependency coastline-prepare-for-sparc64-niagara failed (or also skipped).
sparc64/ultra Skipped View (tail)
Skipped: dependency coastline-prepare-for-sparc64-ultra failed (or also skipped).

libgmp(back to top)

Architecture Result Download Log Duration
Tarball fetch OK View (tail) 1 s
  1800K .......... .......... .......... .......... .......... 86% 45.4M 0s
  1850K .......... .......... .......... .......... .......... 88% 97.7M 0s
  1900K .......... .......... .......... .......... .......... 90% 35.4M 0s
  1950K .......... .......... .......... .......... .......... 93% 83.0M 0s
  2000K .......... .......... .......... .......... .......... 95% 93.1M 0s
  2050K .......... .......... .......... .......... .......... 97% 72.4M 0s
  2100K .......... .......... .......... .......... ...       100%  158M=0.3s

2018-01-25 01:15:20 (6.32 MB/s) - ‘/var/lib/helenos-ci/nightly/tmp-ci/mirror/sources/gmp-5.1.0.tar.bz2’ saved [2194942/2194942]

amd64 Skipped View (tail)
Skipped: dependency coastline-prepare-for-amd64 failed (or also skipped).
arm32/beagleboardxm Skipped View (tail)
Skipped: dependency coastline-prepare-for-arm32-beagleboardxm failed (or also skipped).
arm32/beaglebone Skipped View (tail)
Skipped: dependency coastline-prepare-for-arm32-beaglebone failed (or also skipped).
arm32/gta02 Skipped View (tail)
Skipped: dependency coastline-prepare-for-arm32-gta02 failed (or also skipped).
arm32/integratorcp Skipped View (tail)
Skipped: dependency coastline-prepare-for-arm32-integratorcp failed (or also skipped).
arm32/raspberrypi Skipped View (tail)
Skipped: dependency coastline-prepare-for-arm32-raspberrypi failed (or also skipped).
ia32 Skipped View (tail)
Skipped: dependency coastline-prepare-for-ia32 failed (or also skipped).
ia64/i460GX Skipped View (tail)
Skipped: dependency coastline-prepare-for-ia64-i460GX failed (or also skipped).
ia64/ski Skipped View (tail)
Skipped: dependency coastline-prepare-for-ia64-ski failed (or also skipped).
mips32/malta-be Skipped View (tail)
Skipped: dependency coastline-prepare-for-mips32-malta-be failed (or also skipped).
mips32/malta-le Skipped View (tail)
Skipped: dependency coastline-prepare-for-mips32-malta-le failed (or also skipped).
mips32/msim Skipped View (tail)
Skipped: dependency coastline-prepare-for-mips32-msim failed (or also skipped).
ppc32 Skipped View (tail)
Skipped: dependency coastline-prepare-for-ppc32 failed (or also skipped).
sparc64/niagara Skipped View (tail)
Skipped: dependency coastline-prepare-for-sparc64-niagara failed (or also skipped).
sparc64/ultra Skipped View (tail)
Skipped: dependency coastline-prepare-for-sparc64-ultra failed (or also skipped).

libiconv(back to top)

Architecture Result Download Log Duration
Tarball fetch OK View (tail) 1 s
  4550K .......... .......... .......... .......... .......... 94% 47.5M 0s
  4600K .......... .......... .......... .......... .......... 95% 49.6M 0s
  4650K .......... .......... .......... .......... .......... 96% 68.4M 0s
  4700K .......... .......... .......... .......... .......... 97% 96.4M 0s
  4750K .......... .......... .......... .......... .......... 98%  109M 0s
  4800K .......... .......... .......... .......... .......... 99%  108M 0s
  4850K .......... .......                                    100%  115M=1.1s

2018-01-25 01:15:21 (4.49 MB/s) - ‘/var/lib/helenos-ci/nightly/tmp-ci/mirror/sources/libiconv-1.14.tar.gz’ saved [4984397/4984397]

amd64 Skipped View (tail)
Skipped: dependency coastline-prepare-for-amd64 failed (or also skipped).
arm32/beagleboardxm Skipped View (tail)
Skipped: dependency coastline-prepare-for-arm32-beagleboardxm failed (or also skipped).
arm32/beaglebone Skipped View (tail)
Skipped: dependency coastline-prepare-for-arm32-beaglebone failed (or also skipped).
arm32/gta02 Skipped View (tail)
Skipped: dependency coastline-prepare-for-arm32-gta02 failed (or also skipped).
arm32/integratorcp Skipped View (tail)
Skipped: dependency coastline-prepare-for-arm32-integratorcp failed (or also skipped).
arm32/raspberrypi Skipped View (tail)
Skipped: dependency coastline-prepare-for-arm32-raspberrypi failed (or also skipped).
ia32 Skipped View (tail)
Skipped: dependency coastline-prepare-for-ia32 failed (or also skipped).
ia64/i460GX Skipped View (tail)
Skipped: dependency coastline-prepare-for-ia64-i460GX failed (or also skipped).
ia64/ski Skipped View (tail)
Skipped: dependency coastline-prepare-for-ia64-ski failed (or also skipped).
mips32/malta-be Skipped View (tail)
Skipped: dependency coastline-prepare-for-mips32-malta-be failed (or also skipped).
mips32/malta-le Skipped View (tail)
Skipped: dependency coastline-prepare-for-mips32-malta-le failed (or also skipped).
mips32/msim Skipped View (tail)
Skipped: dependency coastline-prepare-for-mips32-msim failed (or also skipped).
ppc32 Skipped View (tail)
Skipped: dependency coastline-prepare-for-ppc32 failed (or also skipped).
sparc64/niagara Skipped View (tail)
Skipped: dependency coastline-prepare-for-sparc64-niagara failed (or also skipped).
sparc64/ultra Skipped View (tail)
Skipped: dependency coastline-prepare-for-sparc64-ultra failed (or also skipped).

libisl(back to top)

Architecture Result Download Log Duration
Tarball fetch OK View (tail) 0 s
   900K .......... .......... .......... .......... .......... 78% 97.3M 0s
   950K .......... .......... .......... .......... .......... 82%  122M 0s
  1000K .......... .......... .......... .......... .......... 86%  108M 0s
  1050K .......... .......... .......... .......... .......... 90%  109M 0s
  1100K .......... .......... .......... .......... .......... 94% 97.9M 0s
  1150K .......... .......... .......... .......... .......... 98% 13.4M 0s
  1200K .......... .....                                      100%  101M=0.2s

2018-01-25 01:15:22 (7.91 MB/s) - ‘/var/lib/helenos-ci/nightly/tmp-ci/mirror/sources/isl-0.11.1.tar.bz2’ saved [1244610/1244610]

amd64 Skipped View (tail)
Skipped: dependency coastline-build-libgmp-for-amd64 failed (or also skipped).
arm32/beagleboardxm Skipped View (tail)
Skipped: dependency coastline-build-libgmp-for-arm32-beagleboardxm failed (or also skipped).
arm32/beaglebone Skipped View (tail)
Skipped: dependency coastline-build-libgmp-for-arm32-beaglebone failed (or also skipped).
arm32/gta02 Skipped View (tail)
Skipped: dependency coastline-build-libgmp-for-arm32-gta02 failed (or also skipped).
arm32/integratorcp Skipped View (tail)
Skipped: dependency coastline-build-libgmp-for-arm32-integratorcp failed (or also skipped).
arm32/raspberrypi Skipped View (tail)
Skipped: dependency coastline-build-libgmp-for-arm32-raspberrypi failed (or also skipped).
ia32 Skipped View (tail)
Skipped: dependency coastline-build-libgmp-for-ia32 failed (or also skipped).
ia64/i460GX Skipped View (tail)
Skipped: dependency coastline-build-libgmp-for-ia64-i460GX failed (or also skipped).
ia64/ski Skipped View (tail)
Skipped: dependency coastline-build-libgmp-for-ia64-ski failed (or also skipped).
mips32/malta-be Skipped View (tail)
Skipped: dependency coastline-build-libgmp-for-mips32-malta-be failed (or also skipped).
mips32/malta-le Skipped View (tail)
Skipped: dependency coastline-build-libgmp-for-mips32-malta-le failed (or also skipped).
mips32/msim Skipped View (tail)
Skipped: dependency coastline-build-libgmp-for-mips32-msim failed (or also skipped).
ppc32 Skipped View (tail)
Skipped: dependency coastline-build-libgmp-for-ppc32 failed (or also skipped).
sparc64/niagara Skipped View (tail)
Skipped: dependency coastline-build-libgmp-for-sparc64-niagara failed (or also skipped).
sparc64/ultra Skipped View (tail)
Skipped: dependency coastline-build-libgmp-for-sparc64-ultra failed (or also skipped).

libmpc(back to top)

Architecture Result Download Log Duration
Tarball fetch OK View (tail) 2 s
   300K .......... .......... .......... .......... .......... 57% 39.7M 0s
   350K .......... .......... .......... .......... .......... 65% 68.7M 0s
   400K .......... .......... .......... .......... .......... 73% 81.9M 0s
   450K .......... .......... .......... .......... .......... 82% 88.4M 0s
   500K .......... .......... .......... .......... .......... 90% 33.7M 0s
   550K .......... .......... .......... .......... .......... 98%  457K 0s
   600K .........                                             100% 36.3M=0.7s

2018-01-25 01:15:26 (890 KB/s) - ‘/var/lib/helenos-ci/nightly/tmp-ci/mirror/sources/mpc-1.0.1.tar.gz’ saved [624125]

amd64 Skipped View (tail)
Skipped: dependency coastline-build-libmpfr-for-amd64 failed (or also skipped).
arm32/beagleboardxm Skipped View (tail)
Skipped: dependency coastline-build-libmpfr-for-arm32-beagleboardxm failed (or also skipped).
arm32/beaglebone Skipped View (tail)
Skipped: dependency coastline-build-libmpfr-for-arm32-beaglebone failed (or also skipped).
arm32/gta02 Skipped View (tail)
Skipped: dependency coastline-build-libmpfr-for-arm32-gta02 failed (or also skipped).
arm32/integratorcp Skipped View (tail)
Skipped: dependency coastline-build-libmpfr-for-arm32-integratorcp failed (or also skipped).
arm32/raspberrypi Skipped View (tail)
Skipped: dependency coastline-build-libmpfr-for-arm32-raspberrypi failed (or also skipped).
ia32 Skipped View (tail)
Skipped: dependency coastline-build-libmpfr-for-ia32 failed (or also skipped).
ia64/i460GX Skipped View (tail)
Skipped: dependency coastline-build-libmpfr-for-ia64-i460GX failed (or also skipped).
ia64/ski Skipped View (tail)
Skipped: dependency coastline-build-libmpfr-for-ia64-ski failed (or also skipped).
mips32/malta-be Skipped View (tail)
Skipped: dependency coastline-build-libmpfr-for-mips32-malta-be failed (or also skipped).
mips32/malta-le Skipped View (tail)
Skipped: dependency coastline-build-libmpfr-for-mips32-malta-le failed (or also skipped).
mips32/msim Skipped View (tail)
Skipped: dependency coastline-build-libmpfr-for-mips32-msim failed (or also skipped).
ppc32 Skipped View (tail)
Skipped: dependency coastline-build-libmpfr-for-ppc32 failed (or also skipped).
sparc64/niagara Skipped View (tail)
Skipped: dependency coastline-build-libmpfr-for-sparc64-niagara failed (or also skipped).
sparc64/ultra Skipped View (tail)
Skipped: dependency coastline-build-libmpfr-for-sparc64-ultra failed (or also skipped).

libmpfr(back to top)

Architecture Result Download Log Duration
Tarball fetch OK View (tail) 2 s
   850K .......... .......... .......... .......... .......... 75% 2.22M 0s
   900K .......... .......... .......... .......... .......... 79% 55.5M 0s
   950K .......... .......... .......... .......... .......... 84% 52.5M 0s
  1000K .......... .......... .......... .......... .......... 88% 1.71M 0s
  1050K .......... .......... .......... .......... .......... 92%  151M 0s
  1100K .......... .......... .......... .......... .......... 96%  136M 0s
  1150K .......... .......... .......... ..........           100%  158K=0.5s

2018-01-25 01:15:24 (2.57 MB/s) - ‘/var/lib/helenos-ci/nightly/tmp-ci/mirror/sources/mpfr-3.1.1.tar.bz2’ saved [1218825/1218825]

amd64 Skipped View (tail)
Skipped: dependency coastline-build-fdlibm-for-amd64 failed (or also skipped).
arm32/beagleboardxm Skipped View (tail)
Skipped: dependency coastline-build-fdlibm-for-arm32-beagleboardxm failed (or also skipped).
arm32/beaglebone Skipped View (tail)
Skipped: dependency coastline-build-fdlibm-for-arm32-beaglebone failed (or also skipped).
arm32/gta02 Skipped View (tail)
Skipped: dependency coastline-build-fdlibm-for-arm32-gta02 failed (or also skipped).
arm32/integratorcp Skipped View (tail)
Skipped: dependency coastline-build-fdlibm-for-arm32-integratorcp failed (or also skipped).
arm32/raspberrypi Skipped View (tail)
Skipped: dependency coastline-build-fdlibm-for-arm32-raspberrypi failed (or also skipped).
ia32 Skipped View (tail)
Skipped: dependency coastline-build-fdlibm-for-ia32 failed (or also skipped).
ia64/i460GX Skipped View (tail)
Skipped: dependency coastline-build-fdlibm-for-ia64-i460GX failed (or also skipped).
ia64/ski Skipped View (tail)
Skipped: dependency coastline-build-fdlibm-for-ia64-ski failed (or also skipped).
mips32/malta-be Skipped View (tail)
Skipped: dependency coastline-build-fdlibm-for-mips32-malta-be failed (or also skipped).
mips32/malta-le Skipped View (tail)
Skipped: dependency coastline-build-fdlibm-for-mips32-malta-le failed (or also skipped).
mips32/msim Skipped View (tail)
Skipped: dependency coastline-build-fdlibm-for-mips32-msim failed (or also skipped).
ppc32 Skipped View (tail)
Skipped: dependency coastline-build-fdlibm-for-ppc32 failed (or also skipped).
sparc64/niagara Skipped View (tail)
Skipped: dependency coastline-build-fdlibm-for-sparc64-niagara failed (or also skipped).
sparc64/ultra Skipped View (tail)
Skipped: dependency coastline-build-fdlibm-for-sparc64-ultra failed (or also skipped).

libpng(back to top)

Architecture Result Download Log Duration
Tarball fetch OK View (tail) 1 s
  1000K .......... .......... .......... .......... .......... 79%  132M 0s
  1050K .......... .......... .......... .......... .......... 83% 42.6M 0s
  1100K .......... .......... .......... .......... .......... 86%  110M 0s
  1150K .......... .......... .......... .......... .......... 90% 39.8M 0s
  1200K .......... .......... .......... .......... .......... 94% 46.6M 0s
  1250K .......... .......... .......... .......... .......... 98%  124M 0s
  1300K .......... .......... ..                              100%  190M=0.1s

2018-01-25 01:15:23 (10.9 MB/s) - ‘/var/lib/helenos-ci/nightly/tmp-ci/mirror/sources/libpng-1.6.12.tar.gz’ saved [1354223/1354223]

amd64 Skipped View (tail)
Skipped: dependency coastline-build-zlib-for-amd64 failed (or also skipped).
arm32/beagleboardxm Skipped View (tail)
Skipped: dependency coastline-build-zlib-for-arm32-beagleboardxm failed (or also skipped).
arm32/beaglebone Skipped View (tail)
Skipped: dependency coastline-build-zlib-for-arm32-beaglebone failed (or also skipped).
arm32/gta02 Skipped View (tail)
Skipped: dependency coastline-build-zlib-for-arm32-gta02 failed (or also skipped).
arm32/integratorcp Skipped View (tail)
Skipped: dependency coastline-build-zlib-for-arm32-integratorcp failed (or also skipped).
arm32/raspberrypi Skipped View (tail)
Skipped: dependency coastline-build-zlib-for-arm32-raspberrypi failed (or also skipped).
ia32 Skipped View (tail)
Skipped: dependency coastline-build-zlib-for-ia32 failed (or also skipped).
ia64/i460GX Skipped View (tail)
Skipped: dependency coastline-build-zlib-for-ia64-i460GX failed (or also skipped).
ia64/ski Skipped View (tail)
Skipped: dependency coastline-build-zlib-for-ia64-ski failed (or also skipped).
mips32/malta-be Skipped View (tail)
Skipped: dependency coastline-build-zlib-for-mips32-malta-be failed (or also skipped).
mips32/malta-le Skipped View (tail)
Skipped: dependency coastline-build-zlib-for-mips32-malta-le failed (or also skipped).
mips32/msim Skipped View (tail)
Skipped: dependency coastline-build-zlib-for-mips32-msim failed (or also skipped).
ppc32 Skipped View (tail)
Skipped: dependency coastline-build-zlib-for-ppc32 failed (or also skipped).
sparc64/niagara Skipped View (tail)
Skipped: dependency coastline-build-zlib-for-sparc64-niagara failed (or also skipped).
sparc64/ultra Skipped View (tail)
Skipped: dependency coastline-build-zlib-for-sparc64-ultra failed (or also skipped).

msim(back to top)

Architecture Result Download Log Duration
Tarball fetch OK View (tail) 0 s
Length: 167755 (164K) [application/x-bzip2]
Saving to: ‘/var/lib/helenos-ci/nightly/tmp-ci/mirror/sources/msim-1.3.8.1.tar.bz2’

     0K .......... .......... .......... .......... .......... 30% 35.5M 0s
    50K .......... .......... .......... .......... .......... 61% 54.6M 0s
   100K .......... .......... .......... .......... .......... 91% 63.7M 0s
   150K .......... ...                                        100% 38.6M=0.003s

2018-01-25 01:15:20 (47.3 MB/s) - ‘/var/lib/helenos-ci/nightly/tmp-ci/mirror/sources/msim-1.3.8.1.tar.bz2’ saved [167755/167755]

amd64 Skipped View (tail)
Skipped: dependency coastline-prepare-for-amd64 failed (or also skipped).
arm32/beagleboardxm Skipped View (tail)
Skipped: dependency coastline-prepare-for-arm32-beagleboardxm failed (or also skipped).
arm32/beaglebone Skipped View (tail)
Skipped: dependency coastline-prepare-for-arm32-beaglebone failed (or also skipped).
arm32/gta02 Skipped View (tail)
Skipped: dependency coastline-prepare-for-arm32-gta02 failed (or also skipped).
arm32/integratorcp Skipped View (tail)
Skipped: dependency coastline-prepare-for-arm32-integratorcp failed (or also skipped).
arm32/raspberrypi Skipped View (tail)
Skipped: dependency coastline-prepare-for-arm32-raspberrypi failed (or also skipped).
ia32 Skipped View (tail)
Skipped: dependency coastline-prepare-for-ia32 failed (or also skipped).
ia64/i460GX Skipped View (tail)
Skipped: dependency coastline-prepare-for-ia64-i460GX failed (or also skipped).
ia64/ski Skipped View (tail)
Skipped: dependency coastline-prepare-for-ia64-ski failed (or also skipped).
mips32/malta-be Skipped View (tail)
Skipped: dependency coastline-prepare-for-mips32-malta-be failed (or also skipped).
mips32/malta-le Skipped View (tail)
Skipped: dependency coastline-prepare-for-mips32-malta-le failed (or also skipped).
mips32/msim Skipped View (tail)
Skipped: dependency coastline-prepare-for-mips32-msim failed (or also skipped).
ppc32 Skipped View (tail)
Skipped: dependency coastline-prepare-for-ppc32 failed (or also skipped).
sparc64/niagara Skipped View (tail)
Skipped: dependency coastline-prepare-for-sparc64-niagara failed (or also skipped).
sparc64/ultra Skipped View (tail)
Skipped: dependency coastline-prepare-for-sparc64-ultra failed (or also skipped).

pcc(back to top)

Architecture Result Download Log Duration
Tarball fetch OK View (tail) 3 s
   300K .......... .......... .......... .......... .......... 54%  644K 0s
   350K .......... .......... .......... .......... .......... 62% 1.17M 0s
   400K .......... .......... .......... .......... .......... 70%  643K 0s
   450K .......... .......... .......... .......... .......... 78% 1.18M 0s
   500K .......... .......... .......... .......... .......... 86%  644K 0s
   550K .......... .......... .......... .......... .......... 94%  653K 0s
   600K .......... .......... .......... .......              100%  211K=1.0s

2018-01-25 01:15:22 (635 KB/s) - ‘/var/lib/helenos-ci/nightly/tmp-ci/mirror/sources/pcc-1.0.0.tgz’ saved [652308]

amd64 Skipped View (tail)
Skipped: dependency coastline-prepare-for-amd64 failed (or also skipped).
arm32/beagleboardxm Skipped View (tail)
Skipped: dependency coastline-prepare-for-arm32-beagleboardxm failed (or also skipped).
arm32/beaglebone Skipped View (tail)
Skipped: dependency coastline-prepare-for-arm32-beaglebone failed (or also skipped).
arm32/gta02 Skipped View (tail)
Skipped: dependency coastline-prepare-for-arm32-gta02 failed (or also skipped).
arm32/integratorcp Skipped View (tail)
Skipped: dependency coastline-prepare-for-arm32-integratorcp failed (or also skipped).
arm32/raspberrypi Skipped View (tail)
Skipped: dependency coastline-prepare-for-arm32-raspberrypi failed (or also skipped).
ia32 Skipped View (tail)
Skipped: dependency coastline-prepare-for-ia32 failed (or also skipped).
ia64/i460GX Skipped View (tail)
Skipped: dependency coastline-prepare-for-ia64-i460GX failed (or also skipped).
ia64/ski Skipped View (tail)
Skipped: dependency coastline-prepare-for-ia64-ski failed (or also skipped).
mips32/malta-be Skipped View (tail)
Skipped: dependency coastline-prepare-for-mips32-malta-be failed (or also skipped).
mips32/malta-le Skipped View (tail)
Skipped: dependency coastline-prepare-for-mips32-malta-le failed (or also skipped).
mips32/msim Skipped View (tail)
Skipped: dependency coastline-prepare-for-mips32-msim failed (or also skipped).
ppc32 Skipped View (tail)
Skipped: dependency coastline-prepare-for-ppc32 failed (or also skipped).
sparc64/niagara Skipped View (tail)
Skipped: dependency coastline-prepare-for-sparc64-niagara failed (or also skipped).
sparc64/ultra Skipped View (tail)
Skipped: dependency coastline-prepare-for-sparc64-ultra failed (or also skipped).

python2(back to top)

Architecture Result Download Log Duration
Tarball fetch OK View (tail) 1 s
  9850K .......... .......... .......... .......... .......... 97% 74.9M 0s
  9900K .......... .......... .......... .......... .......... 97% 36.6M 0s
  9950K .......... .......... .......... .......... .......... 98% 39.2M 0s
 10000K .......... .......... .......... .......... .......... 98% 41.7M 0s
 10050K .......... .......... .......... .......... .......... 99% 80.2M 0s
 10100K .......... .......... .......... .......... .......... 99% 15.6M 0s
 10150K .......... .......... .......... ......               100% 38.8M=0.6s

2018-01-25 01:15:24 (16.1 MB/s) - ‘/var/lib/helenos-ci/nightly/tmp-ci/mirror/sources/Python-2.7.6.tar.xz’ saved [10431288/10431288]

amd64 Skipped View (tail)
Skipped: dependency coastline-build-fdlibm-for-amd64 failed (or also skipped).
arm32/beagleboardxm Skipped View (tail)
Skipped: dependency coastline-build-fdlibm-for-arm32-beagleboardxm failed (or also skipped).
arm32/beaglebone Skipped View (tail)
Skipped: dependency coastline-build-fdlibm-for-arm32-beaglebone failed (or also skipped).
arm32/gta02 Skipped View (tail)
Skipped: dependency coastline-build-fdlibm-for-arm32-gta02 failed (or also skipped).
arm32/integratorcp Skipped View (tail)
Skipped: dependency coastline-build-fdlibm-for-arm32-integratorcp failed (or also skipped).
arm32/raspberrypi Skipped View (tail)
Skipped: dependency coastline-build-fdlibm-for-arm32-raspberrypi failed (or also skipped).
ia32 Skipped View (tail)
Skipped: dependency coastline-build-fdlibm-for-ia32 failed (or also skipped).
ia64/i460GX Skipped View (tail)
Skipped: dependency coastline-build-fdlibm-for-ia64-i460GX failed (or also skipped).
ia64/ski Skipped View (tail)
Skipped: dependency coastline-build-fdlibm-for-ia64-ski failed (or also skipped).
mips32/malta-be Skipped View (tail)
Skipped: dependency coastline-build-fdlibm-for-mips32-malta-be failed (or also skipped).
mips32/malta-le Skipped View (tail)
Skipped: dependency coastline-build-fdlibm-for-mips32-malta-le failed (or also skipped).
mips32/msim Skipped View (tail)
Skipped: dependency coastline-build-fdlibm-for-mips32-msim failed (or also skipped).
ppc32 Skipped View (tail)
Skipped: dependency coastline-build-fdlibm-for-ppc32 failed (or also skipped).
sparc64/niagara Skipped View (tail)
Skipped: dependency coastline-build-fdlibm-for-sparc64-niagara failed (or also skipped).
sparc64/ultra Skipped View (tail)
Skipped: dependency coastline-build-fdlibm-for-sparc64-ultra failed (or also skipped).

zlib(back to top)

Architecture Result Download Log Duration
Tarball fetch OK View (tail) 1 s
   250K .......... .......... .......... .......... .......... 50% 90.2M 1s
   300K .......... .......... .......... .......... .......... 58% 96.3M 0s
   350K .......... .......... .......... .......... .......... 67% 97.1M 0s
   400K .......... .......... .......... .......... .......... 75%  300K 0s
   450K .......... .......... .......... .......... .......... 84% 97.4M 0s
   500K .......... .......... .......... .......... .......... 92%  108M 0s
   550K .......... .......... .......... .......... ...       100% 94.9M=0.8s

2018-01-25 01:15:22 (705 KB/s) - ‘/var/lib/helenos-ci/nightly/tmp-ci/mirror/sources/zlib-1.2.11.tar.gz’ saved [607698/607698]

amd64 Skipped View (tail)
Skipped: dependency coastline-prepare-for-amd64 failed (or also skipped).
arm32/beagleboardxm Skipped View (tail)
Skipped: dependency coastline-prepare-for-arm32-beagleboardxm failed (or also skipped).
arm32/beaglebone Skipped View (tail)
Skipped: dependency coastline-prepare-for-arm32-beaglebone failed (or also skipped).
arm32/gta02 Skipped View (tail)
Skipped: dependency coastline-prepare-for-arm32-gta02 failed (or also skipped).
arm32/integratorcp Skipped View (tail)
Skipped: dependency coastline-prepare-for-arm32-integratorcp failed (or also skipped).
arm32/raspberrypi Skipped View (tail)
Skipped: dependency coastline-prepare-for-arm32-raspberrypi failed (or also skipped).
ia32 Skipped View (tail)
Skipped: dependency coastline-prepare-for-ia32 failed (or also skipped).
ia64/i460GX Skipped View (tail)
Skipped: dependency coastline-prepare-for-ia64-i460GX failed (or also skipped).
ia64/ski Skipped View (tail)
Skipped: dependency coastline-prepare-for-ia64-ski failed (or also skipped).
mips32/malta-be Skipped View (tail)
Skipped: dependency coastline-prepare-for-mips32-malta-be failed (or also skipped).
mips32/malta-le Skipped View (tail)
Skipped: dependency coastline-prepare-for-mips32-malta-le failed (or also skipped).
mips32/msim Skipped View (tail)
Skipped: dependency coastline-prepare-for-mips32-msim failed (or also skipped).
ppc32 Skipped View (tail)
Skipped: dependency coastline-prepare-for-ppc32 failed (or also skipped).
sparc64/niagara Skipped View (tail)
Skipped: dependency coastline-prepare-for-sparc64-niagara failed (or also skipped).
sparc64/ultra Skipped View (tail)
Skipped: dependency coastline-prepare-for-sparc64-ultra failed (or also skipped).

Per-scenario details(back to top)

base/fs.test(back to top)

Architecture Result Download Log Duration
amd64 Skipped View (tail)
Skipped: dependency helenos-build-amd64 failed (or also skipped).
arm32/integratorcp Skipped View (tail)
Skipped: dependency helenos-build-arm32-integratorcp failed (or also skipped).
ia32 Skipped View (tail)
Skipped: dependency helenos-build-ia32 failed (or also skipped).
ppc32 Skipped View (tail)
Skipped: dependency helenos-build-ppc32 failed (or also skipped).

base/tester_malloc1.test(back to top)

Architecture Result Download Log Duration
amd64 Skipped View (tail)
Skipped: dependency helenos-build-amd64 failed (or also skipped).
arm32/integratorcp Skipped View (tail)
Skipped: dependency helenos-build-arm32-integratorcp failed (or also skipped).
ia32 Skipped View (tail)
Skipped: dependency helenos-build-ia32 failed (or also skipped).
ppc32 Skipped View (tail)
Skipped: dependency helenos-build-ppc32 failed (or also skipped).

boot.test(back to top)

Architecture Result Download Log Duration
amd64 Skipped View (tail)
Skipped: dependency helenos-build-amd64 failed (or also skipped).
arm32/integratorcp Skipped View (tail)
Skipped: dependency helenos-build-arm32-integratorcp failed (or also skipped).
ia32 Skipped View (tail)
Skipped: dependency helenos-build-ia32 failed (or also skipped).
ppc32 Skipped View (tail)
Skipped: dependency helenos-build-ppc32 failed (or also skipped).

coast/gcc/version.test(back to top)

Architecture Result Download Log Duration
amd64 Skipped View (tail)
Skipped: dependency extra-amd64-with-gcc failed (or also skipped).
arm32/integratorcp Skipped View (tail)
Skipped: dependency extra-arm32-integratorcp-with-gcc failed (or also skipped).
ia32 Skipped View (tail)
Skipped: dependency extra-ia32-with-gcc failed (or also skipped).
ppc32 Skipped View (tail)
Skipped: dependency extra-ppc32-with-gcc failed (or also skipped).

coast/libgmp/smoke.test(back to top)

Architecture Result Download Log Duration
amd64 Skipped View (tail)
Skipped: dependency extra-amd64-with-libgmp failed (or also skipped).
arm32/integratorcp Skipped View (tail)
Skipped: dependency extra-arm32-integratorcp-with-libgmp failed (or also skipped).
ia32 Skipped View (tail)
Skipped: dependency extra-ia32-with-libgmp failed (or also skipped).
ppc32 Skipped View (tail)
Skipped: dependency extra-ppc32-with-libgmp failed (or also skipped).

coast/libiconv/version.test(back to top)

Architecture Result Download Log Duration
amd64 Skipped View (tail)
Skipped: dependency extra-amd64-with-libiconv failed (or also skipped).
arm32/integratorcp Skipped View (tail)
Skipped: dependency extra-arm32-integratorcp-with-libiconv failed (or also skipped).
ia32 Skipped View (tail)
Skipped: dependency extra-ia32-with-libiconv failed (or also skipped).
ppc32 Skipped View (tail)
Skipped: dependency extra-ppc32-with-libiconv failed (or also skipped).

coast/libisl/smoke.test(back to top)

Architecture Result Download Log Duration
amd64 Skipped View (tail)
Skipped: dependency extra-amd64-with-libisl failed (or also skipped).
arm32/integratorcp Skipped View (tail)
Skipped: dependency extra-arm32-integratorcp-with-libisl failed (or also skipped).
ia32 Skipped View (tail)
Skipped: dependency extra-ia32-with-libisl failed (or also skipped).
ppc32 Skipped View (tail)
Skipped: dependency extra-ppc32-with-libisl failed (or also skipped).

coast/libmpc/smoke.test(back to top)

Architecture Result Download Log Duration
amd64 Skipped View (tail)
Skipped: dependency extra-amd64-with-libmpc failed (or also skipped).
arm32/integratorcp Skipped View (tail)
Skipped: dependency extra-arm32-integratorcp-with-libmpc failed (or also skipped).
ia32 Skipped View (tail)
Skipped: dependency extra-ia32-with-libmpc failed (or also skipped).
ppc32 Skipped View (tail)
Skipped: dependency extra-ppc32-with-libmpc failed (or also skipped).

coast/libmpfr/smoke.test(back to top)

Architecture Result Download Log Duration
amd64 Skipped View (tail)
Skipped: dependency extra-amd64-with-libmpfr failed (or also skipped).
arm32/integratorcp Skipped View (tail)
Skipped: dependency extra-arm32-integratorcp-with-libmpfr failed (or also skipped).
ia32 Skipped View (tail)
Skipped: dependency extra-ia32-with-libmpfr failed (or also skipped).
ppc32 Skipped View (tail)
Skipped: dependency extra-ppc32-with-libmpfr failed (or also skipped).

coast/libpng/pngtest.test(back to top)

Architecture Result Download Log Duration
amd64 Skipped View (tail)
Skipped: dependency extra-amd64-with-libpng failed (or also skipped).
arm32/integratorcp Skipped View (tail)
Skipped: dependency extra-arm32-integratorcp-with-libpng failed (or also skipped).
ia32 Skipped View (tail)
Skipped: dependency extra-ia32-with-libpng failed (or also skipped).
ppc32 Skipped View (tail)
Skipped: dependency extra-ppc32-with-libpng failed (or also skipped).

coast/pcc/hello.test(back to top)

Architecture Result Download Log Duration
amd64 Skipped View (tail)
Skipped: dependency extra-amd64-with-binutils-pcc failed (or also skipped).
arm32/integratorcp Skipped View (tail)
Skipped: dependency extra-arm32-integratorcp-with-binutils-pcc failed (or also skipped).
ia32 Skipped View (tail)
Skipped: dependency extra-ia32-with-binutils-pcc failed (or also skipped).
ppc32 Skipped View (tail)
Skipped: dependency extra-ppc32-with-binutils-pcc failed (or also skipped).

coast/pcc/version.test(back to top)

Architecture Result Download Log Duration
amd64 Skipped View (tail)
Skipped: dependency extra-amd64-with-pcc failed (or also skipped).
arm32/integratorcp Skipped View (tail)
Skipped: dependency extra-arm32-integratorcp-with-pcc failed (or also skipped).
ia32 Skipped View (tail)
Skipped: dependency extra-ia32-with-pcc failed (or also skipped).
ppc32 Skipped View (tail)
Skipped: dependency extra-ppc32-with-pcc failed (or also skipped).

coast/python2/hello.test(back to top)

Architecture Result Download Log Duration
amd64 Skipped View (tail)
Skipped: dependency extra-amd64-with-python2 failed (or also skipped).
arm32/integratorcp Skipped View (tail)
Skipped: dependency extra-arm32-integratorcp-with-python2 failed (or also skipped).
ia32 Skipped View (tail)
Skipped: dependency extra-ia32-with-python2 failed (or also skipped).
ppc32 Skipped View (tail)
Skipped: dependency extra-ppc32-with-python2 failed (or also skipped).

coast/python2/version.test(back to top)

Architecture Result Download Log Duration
amd64 Skipped View (tail)
Skipped: dependency extra-amd64-with-python2 failed (or also skipped).
arm32/integratorcp Skipped View (tail)
Skipped: dependency extra-arm32-integratorcp-with-python2 failed (or also skipped).
ia32 Skipped View (tail)
Skipped: dependency extra-ia32-with-python2 failed (or also skipped).
ppc32 Skipped View (tail)
Skipped: dependency extra-ppc32-with-python2 failed (or also skipped).

coast/zlib/minigzip.test(back to top)

Architecture Result Download Log Duration
amd64 Skipped View (tail)
Skipped: dependency extra-amd64-with-zlib failed (or also skipped).
arm32/integratorcp Skipped View (tail)
Skipped: dependency extra-arm32-integratorcp-with-zlib failed (or also skipped).
ia32 Skipped View (tail)
Skipped: dependency extra-ia32-with-zlib failed (or also skipped).
ppc32 Skipped View (tail)
Skipped: dependency extra-ppc32-with-zlib failed (or also skipped).