HelenOS continuous integration testing

Build 172 from 2018-05-11 01:17:11+02:00 (45 min 51 s)

Summary results

Task Success Details (total = ok + failed + skipped)
Repository checkouts 100 % 2 = 2 + 0 + 0
HelenOS builds 0 % 17 = 0 + 17 + 0
Tarball fetches for Coastline 93 % 14 = 13 + 1 + 0
Coastline builds 0 % 224 = 0 + 0 + 224
Testing scenarios 0 % 60 = 0 + 0 + 60

Summary matrix(back to top)

amd64 arm32 beagle­board­xm arm32 beagle­bone arm32 gta02 arm32 inte­gra­torcp arm32 rasp­ber­ry­pi ia32 ia64 i460GX ia64 ski mips32 malta­-be mips32 malta­-le mips32 msim ppc32 riscv64 sparc64 niagara sparc64 ultra special abs32le
HelenOS Failed Failed Failed Failed Failed Failed Failed Failed Failed Failed Failed Failed Failed Failed Failed Failed Failed
binutils Skipped Skipped Skipped Skipped Skipped Skipped Skipped Skipped Skipped Skipped Skipped Skipped Skipped Skipped Skipped Skipped N/A
fdlibm Skipped Skipped Skipped Skipped Skipped Skipped Skipped Skipped Skipped Skipped Skipped Skipped Skipped Skipped Skipped Skipped N/A
gcc Skipped Skipped Skipped Skipped Skipped Skipped Skipped Skipped Skipped Skipped Skipped Skipped Skipped Skipped Skipped Skipped N/A
jainja Skipped Skipped Skipped Skipped Skipped Skipped Skipped Skipped Skipped Skipped Skipped Skipped Skipped Skipped Skipped Skipped N/A
libgmp Skipped Skipped Skipped Skipped Skipped Skipped Skipped Skipped Skipped Skipped Skipped Skipped Skipped Skipped Skipped Skipped N/A
libiconv Skipped Skipped Skipped Skipped Skipped Skipped Skipped Skipped Skipped Skipped Skipped Skipped Skipped Skipped Skipped Skipped N/A
libisl Skipped Skipped Skipped Skipped Skipped Skipped Skipped Skipped Skipped Skipped Skipped Skipped Skipped Skipped Skipped Skipped N/A
libmpc Skipped Skipped Skipped Skipped Skipped Skipped Skipped Skipped Skipped Skipped Skipped Skipped Skipped Skipped Skipped Skipped N/A
libmpfr Skipped Skipped Skipped Skipped Skipped Skipped Skipped Skipped Skipped Skipped Skipped Skipped Skipped Skipped Skipped Skipped N/A
libpng Skipped Skipped Skipped Skipped Skipped Skipped Skipped Skipped Skipped Skipped Skipped Skipped Skipped Skipped Skipped Skipped N/A
msim Skipped Skipped Skipped Skipped Skipped Skipped Skipped Skipped Skipped Skipped Skipped Skipped Skipped Skipped Skipped Skipped N/A
pcc Skipped Skipped Skipped Skipped Skipped Skipped Skipped Skipped Skipped Skipped Skipped Skipped Skipped Skipped Skipped Skipped N/A
python2 Skipped Skipped Skipped Skipped Skipped Skipped Skipped Skipped Skipped Skipped Skipped Skipped Skipped Skipped Skipped Skipped N/A
zlib Skipped Skipped Skipped Skipped Skipped Skipped Skipped Skipped Skipped Skipped Skipped Skipped Skipped Skipped Skipped Skipped N/A
base/fs.test Skipped N/A N/A N/A Skipped N/A Skipped N/A N/A N/A N/A N/A Skipped N/A N/A N/A N/A
base/tester_malloc1.test Skipped N/A N/A N/A Skipped N/A Skipped N/A N/A N/A N/A N/A Skipped N/A N/A N/A N/A
boot.test Skipped N/A N/A N/A Skipped N/A Skipped N/A N/A N/A N/A N/A Skipped N/A N/A N/A N/A
coast/gcc/version.test Skipped N/A N/A N/A Skipped N/A Skipped N/A N/A N/A N/A N/A Skipped N/A N/A N/A N/A
coast/libgmp/smoke.test Skipped N/A N/A N/A Skipped N/A Skipped N/A N/A N/A N/A N/A Skipped N/A N/A N/A N/A
coast/libiconv/version.test Skipped N/A N/A N/A Skipped N/A Skipped N/A N/A N/A N/A N/A Skipped N/A N/A N/A N/A
coast/libisl/smoke.test Skipped N/A N/A N/A Skipped N/A Skipped N/A N/A N/A N/A N/A Skipped N/A N/A N/A N/A
coast/libmpc/smoke.test Skipped N/A N/A N/A Skipped N/A Skipped N/A N/A N/A N/A N/A Skipped N/A N/A N/A N/A
coast/libmpfr/smoke.test Skipped N/A N/A N/A Skipped N/A Skipped N/A N/A N/A N/A N/A Skipped N/A N/A N/A N/A
coast/libpng/pngtest.test Skipped N/A N/A N/A Skipped N/A Skipped N/A N/A N/A N/A N/A Skipped N/A N/A N/A N/A
coast/pcc/hello.test Skipped N/A N/A N/A Skipped N/A Skipped N/A N/A N/A N/A N/A Skipped N/A N/A N/A N/A
coast/pcc/version.test Skipped N/A N/A N/A Skipped N/A Skipped N/A N/A N/A N/A N/A Skipped N/A N/A N/A N/A
coast/python2/hello.test Skipped N/A N/A N/A Skipped N/A Skipped N/A N/A N/A N/A N/A Skipped N/A N/A N/A N/A
coast/python2/version.test Skipped N/A N/A N/A Skipped N/A Skipped N/A N/A N/A N/A N/A Skipped N/A N/A N/A N/A
coast/zlib/minigzip.test Skipped N/A N/A N/A Skipped N/A Skipped N/A N/A N/A N/A N/A Skipped N/A N/A N/A N/A

Miscellaneous

List of failed tasks (back to top)

Task Component Architecture Log Duration
HelenOS amd64 View (tail) 74 s
At top level:
exfat_ops.c:1240:13: error: 'exfat_fsinfo' defined but not used [-Werror=unused-function]
 static void exfat_fsinfo(exfat_bs_t *bs, service_id_t service_id)
             ^~~~~~~~~~~~
cc1: all warnings being treated as errors
make[2]: *** [../../../Makefile.common:339: exfat_ops.o] Error 1
make[2]: Leaving directory '/var/lib/helenos-ci/nightly/tmp-ci/build/amd64/helenos/uspace/srv/fs/exfat'
make[1]: *** [Makefile:279: srv/fs/exfat.build] Error 2
make[1]: Leaving directory '/var/lib/helenos-ci/nightly/tmp-ci/build/amd64/helenos/uspace'
make: *** [Makefile:61: uspace] Error 2
HelenOS arm32/beagleboardxm View (tail) 80 s
At top level:
exfat_ops.c:1240:13: error: 'exfat_fsinfo' defined but not used [-Werror=unused-function]
 static void exfat_fsinfo(exfat_bs_t *bs, service_id_t service_id)
             ^~~~~~~~~~~~
cc1: all warnings being treated as errors
make[2]: *** [../../../Makefile.common:339: exfat_ops.o] Error 1
make[2]: Leaving directory '/var/lib/helenos-ci/nightly/tmp-ci/build/arm32-beagleboardxm/helenos/uspace/srv/fs/exfat'
make[1]: *** [Makefile:279: srv/fs/exfat.build] Error 2
make[1]: Leaving directory '/var/lib/helenos-ci/nightly/tmp-ci/build/arm32-beagleboardxm/helenos/uspace'
make: *** [Makefile:61: uspace] Error 2
HelenOS arm32/beaglebone View (tail) 79 s
At top level:
exfat_ops.c:1240:13: error: 'exfat_fsinfo' defined but not used [-Werror=unused-function]
 static void exfat_fsinfo(exfat_bs_t *bs, service_id_t service_id)
             ^~~~~~~~~~~~
cc1: all warnings being treated as errors
make[2]: *** [../../../Makefile.common:339: exfat_ops.o] Error 1
make[2]: Leaving directory '/var/lib/helenos-ci/nightly/tmp-ci/build/arm32-beaglebone/helenos/uspace/srv/fs/exfat'
make[1]: *** [Makefile:279: srv/fs/exfat.build] Error 2
make[1]: Leaving directory '/var/lib/helenos-ci/nightly/tmp-ci/build/arm32-beaglebone/helenos/uspace'
make: *** [Makefile:61: uspace] Error 2
HelenOS arm32/gta02 View (tail) 78 s
At top level:
exfat_ops.c:1240:13: error: 'exfat_fsinfo' defined but not used [-Werror=unused-function]
 static void exfat_fsinfo(exfat_bs_t *bs, service_id_t service_id)
             ^~~~~~~~~~~~
cc1: all warnings being treated as errors
make[2]: *** [../../../Makefile.common:339: exfat_ops.o] Error 1
make[2]: Leaving directory '/var/lib/helenos-ci/nightly/tmp-ci/build/arm32-gta02/helenos/uspace/srv/fs/exfat'
make[1]: *** [Makefile:279: srv/fs/exfat.build] Error 2
make[1]: Leaving directory '/var/lib/helenos-ci/nightly/tmp-ci/build/arm32-gta02/helenos/uspace'
make: *** [Makefile:61: uspace] Error 2
HelenOS arm32/integratorcp View (tail) 79 s
At top level:
exfat_ops.c:1240:13: error: 'exfat_fsinfo' defined but not used [-Werror=unused-function]
 static void exfat_fsinfo(exfat_bs_t *bs, service_id_t service_id)
             ^~~~~~~~~~~~
cc1: all warnings being treated as errors
make[2]: *** [../../../Makefile.common:339: exfat_ops.o] Error 1
make[2]: Leaving directory '/var/lib/helenos-ci/nightly/tmp-ci/build/arm32-integratorcp/helenos/uspace/srv/fs/exfat'
make[1]: *** [Makefile:279: srv/fs/exfat.build] Error 2
make[1]: Leaving directory '/var/lib/helenos-ci/nightly/tmp-ci/build/arm32-integratorcp/helenos/uspace'
make: *** [Makefile:61: uspace] Error 2
HelenOS arm32/raspberrypi View (tail) 77 s
At top level:
exfat_ops.c:1240:13: error: 'exfat_fsinfo' defined but not used [-Werror=unused-function]
 static void exfat_fsinfo(exfat_bs_t *bs, service_id_t service_id)
             ^~~~~~~~~~~~
cc1: all warnings being treated as errors
make[2]: *** [../../../Makefile.common:339: exfat_ops.o] Error 1
make[2]: Leaving directory '/var/lib/helenos-ci/nightly/tmp-ci/build/arm32-raspberrypi/helenos/uspace/srv/fs/exfat'
make[1]: *** [Makefile:279: srv/fs/exfat.build] Error 2
make[1]: Leaving directory '/var/lib/helenos-ci/nightly/tmp-ci/build/arm32-raspberrypi/helenos/uspace'
make: *** [Makefile:61: uspace] Error 2
HelenOS ia32 View (tail) 76 s
At top level:
exfat_ops.c:1240:13: error: 'exfat_fsinfo' defined but not used [-Werror=unused-function]
 static void exfat_fsinfo(exfat_bs_t *bs, service_id_t service_id)
             ^~~~~~~~~~~~
cc1: all warnings being treated as errors
make[2]: *** [../../../Makefile.common:339: exfat_ops.o] Error 1
make[2]: Leaving directory '/var/lib/helenos-ci/nightly/tmp-ci/build/ia32/helenos/uspace/srv/fs/exfat'
make[1]: *** [Makefile:279: srv/fs/exfat.build] Error 2
make[1]: Leaving directory '/var/lib/helenos-ci/nightly/tmp-ci/build/ia32/helenos/uspace'
make: *** [Makefile:61: uspace] Error 2
HelenOS ia64/i460GX View (tail) 2 min 10 s
At top level:
exfat_ops.c:1240:13: error: 'exfat_fsinfo' defined but not used [-Werror=unused-function]
 static void exfat_fsinfo(exfat_bs_t *bs, service_id_t service_id)
             ^~~~~~~~~~~~
cc1: all warnings being treated as errors
make[2]: *** [../../../Makefile.common:339: exfat_ops.o] Error 1
make[2]: Leaving directory '/var/lib/helenos-ci/nightly/tmp-ci/build/ia64-i460GX/helenos/uspace/srv/fs/exfat'
make[1]: *** [Makefile:279: srv/fs/exfat.build] Error 2
make[1]: Leaving directory '/var/lib/helenos-ci/nightly/tmp-ci/build/ia64-i460GX/helenos/uspace'
make: *** [Makefile:61: uspace] Error 2
HelenOS ia64/ski View (tail) 2 min 7 s
At top level:
exfat_ops.c:1240:13: error: 'exfat_fsinfo' defined but not used [-Werror=unused-function]
 static void exfat_fsinfo(exfat_bs_t *bs, service_id_t service_id)
             ^~~~~~~~~~~~
cc1: all warnings being treated as errors
make[2]: *** [../../../Makefile.common:339: exfat_ops.o] Error 1
make[2]: Leaving directory '/var/lib/helenos-ci/nightly/tmp-ci/build/ia64-ski/helenos/uspace/srv/fs/exfat'
make[1]: *** [Makefile:279: srv/fs/exfat.build] Error 2
make[1]: Leaving directory '/var/lib/helenos-ci/nightly/tmp-ci/build/ia64-ski/helenos/uspace'
make: *** [Makefile:61: uspace] Error 2
HelenOS mips32/malta-be View (tail) 79 s
At top level:
exfat_ops.c:1240:13: error: 'exfat_fsinfo' defined but not used [-Werror=unused-function]
 static void exfat_fsinfo(exfat_bs_t *bs, service_id_t service_id)
             ^~~~~~~~~~~~
cc1: all warnings being treated as errors
make[2]: *** [../../../Makefile.common:339: exfat_ops.o] Error 1
make[2]: Leaving directory '/var/lib/helenos-ci/nightly/tmp-ci/build/mips32-malta-be/helenos/uspace/srv/fs/exfat'
make[1]: *** [Makefile:279: srv/fs/exfat.build] Error 2
make[1]: Leaving directory '/var/lib/helenos-ci/nightly/tmp-ci/build/mips32-malta-be/helenos/uspace'
make: *** [Makefile:61: uspace] Error 2
HelenOS mips32/malta-le View (tail) 78 s
At top level:
exfat_ops.c:1240:13: error: 'exfat_fsinfo' defined but not used [-Werror=unused-function]
 static void exfat_fsinfo(exfat_bs_t *bs, service_id_t service_id)
             ^~~~~~~~~~~~
cc1: all warnings being treated as errors
make[2]: *** [../../../Makefile.common:339: exfat_ops.o] Error 1
make[2]: Leaving directory '/var/lib/helenos-ci/nightly/tmp-ci/build/mips32-malta-le/helenos/uspace/srv/fs/exfat'
make[1]: *** [Makefile:279: srv/fs/exfat.build] Error 2
make[1]: Leaving directory '/var/lib/helenos-ci/nightly/tmp-ci/build/mips32-malta-le/helenos/uspace'
make: *** [Makefile:61: uspace] Error 2
HelenOS mips32/msim View (tail) 77 s
At top level:
exfat_ops.c:1240:13: error: 'exfat_fsinfo' defined but not used [-Werror=unused-function]
 static void exfat_fsinfo(exfat_bs_t *bs, service_id_t service_id)
             ^~~~~~~~~~~~
cc1: all warnings being treated as errors
make[2]: *** [../../../Makefile.common:339: exfat_ops.o] Error 1
make[2]: Leaving directory '/var/lib/helenos-ci/nightly/tmp-ci/build/mips32-msim/helenos/uspace/srv/fs/exfat'
make[1]: *** [Makefile:279: srv/fs/exfat.build] Error 2
make[1]: Leaving directory '/var/lib/helenos-ci/nightly/tmp-ci/build/mips32-msim/helenos/uspace'
make: *** [Makefile:61: uspace] Error 2
HelenOS ppc32 View (tail) 73 s
At top level:
exfat_ops.c:1240:13: error: 'exfat_fsinfo' defined but not used [-Werror=unused-function]
 static void exfat_fsinfo(exfat_bs_t *bs, service_id_t service_id)
             ^~~~~~~~~~~~
cc1: all warnings being treated as errors
make[2]: *** [../../../Makefile.common:339: exfat_ops.o] Error 1
make[2]: Leaving directory '/var/lib/helenos-ci/nightly/tmp-ci/build/ppc32/helenos/uspace/srv/fs/exfat'
make[1]: *** [Makefile:279: srv/fs/exfat.build] Error 2
make[1]: Leaving directory '/var/lib/helenos-ci/nightly/tmp-ci/build/ppc32/helenos/uspace'
make: *** [Makefile:61: uspace] Error 2
HelenOS riscv64 View (tail) 68 s
At top level:
exfat_ops.c:1240:13: error: 'exfat_fsinfo' defined but not used [-Werror=unused-function]
 static void exfat_fsinfo(exfat_bs_t *bs, service_id_t service_id)
             ^~~~~~~~~~~~
cc1: all warnings being treated as errors
make[2]: *** [../../../Makefile.common:339: exfat_ops.o] Error 1
make[2]: Leaving directory '/var/lib/helenos-ci/nightly/tmp-ci/build/riscv64/helenos/uspace/srv/fs/exfat'
make[1]: *** [Makefile:279: srv/fs/exfat.build] Error 2
make[1]: Leaving directory '/var/lib/helenos-ci/nightly/tmp-ci/build/riscv64/helenos/uspace'
make: *** [Makefile:61: uspace] Error 2
HelenOS sparc64/niagara View (tail) 68 s
At top level:
exfat_ops.c:1240:13: error: 'exfat_fsinfo' defined but not used [-Werror=unused-function]
 static void exfat_fsinfo(exfat_bs_t *bs, service_id_t service_id)
             ^~~~~~~~~~~~
cc1: all warnings being treated as errors
make[2]: *** [../../../Makefile.common:339: exfat_ops.o] Error 1
make[2]: Leaving directory '/var/lib/helenos-ci/nightly/tmp-ci/build/sparc64-niagara/helenos/uspace/srv/fs/exfat'
make[1]: *** [Makefile:279: srv/fs/exfat.build] Error 2
make[1]: Leaving directory '/var/lib/helenos-ci/nightly/tmp-ci/build/sparc64-niagara/helenos/uspace'
make: *** [Makefile:61: uspace] Error 2
HelenOS sparc64/ultra View (tail) 68 s
At top level:
exfat_ops.c:1240:13: error: 'exfat_fsinfo' defined but not used [-Werror=unused-function]
 static void exfat_fsinfo(exfat_bs_t *bs, service_id_t service_id)
             ^~~~~~~~~~~~
cc1: all warnings being treated as errors
make[2]: *** [../../../Makefile.common:339: exfat_ops.o] Error 1
make[2]: Leaving directory '/var/lib/helenos-ci/nightly/tmp-ci/build/sparc64-ultra/helenos/uspace/srv/fs/exfat'
make[1]: *** [Makefile:279: srv/fs/exfat.build] Error 2
make[1]: Leaving directory '/var/lib/helenos-ci/nightly/tmp-ci/build/sparc64-ultra/helenos/uspace'
make: *** [Makefile:61: uspace] Error 2
HelenOS special/abs32le View (tail) 69 s
At top level:
exfat_ops.c:1240:13: error: 'exfat_fsinfo' defined but not used [-Werror=unused-function]
 static void exfat_fsinfo(exfat_bs_t *bs, service_id_t service_id)
             ^~~~~~~~~~~~
cc1: all warnings being treated as errors
make[2]: *** [../../../Makefile.common:339: exfat_ops.o] Error 1
make[2]: Leaving directory '/var/lib/helenos-ci/nightly/tmp-ci/build/special-abs32le/helenos/uspace/srv/fs/exfat'
make[1]: *** [Makefile:279: srv/fs/exfat.build] Error 2
make[1]: Leaving directory '/var/lib/helenos-ci/nightly/tmp-ci/build/special-abs32le/helenos/uspace'
make: *** [Makefile:61: uspace] Error 2
Tarball fetch libgmp View (tail) 45 min 40 s
--2018-05-11 01:58:32--  (try:19)  https://gmplib.org/download/gmp/gmp-5.1.0.tar.bz2
Connecting to gmplib.org|130.242.124.102|:443... failed: Connection timed out.
Retrying.

--2018-05-11 02:00:52--  (try:20)  https://gmplib.org/download/gmp/gmp-5.1.0.tar.bz2
Connecting to gmplib.org|130.242.124.102|:443... failed: Connection timed out.
Giving up.

[hsct]: Error: Failed to fetch https://gmplib.org/download/gmp/gmp-5.1.0.tar.bz2.

HelenOS (back to top)

Architecture Result Download Log Duration
Source code browser OK Browsable sources View 87 s
Sycek C style check OK View (tail) 9 s
uspace/srv/ns/task.c: no error.
uspace/srv/ns/service.h: no error.
uspace/srv/ns/clonable.c: no error.

Sycek C style checker summary
Files scanned: 3056
Files clean: 2969
Files with issues: 87
Files with errors: 0
Total issues found: 1356
amd64 Failed View (tail) 74 s
At top level:
exfat_ops.c:1240:13: error: 'exfat_fsinfo' defined but not used [-Werror=unused-function]
 static void exfat_fsinfo(exfat_bs_t *bs, service_id_t service_id)
             ^~~~~~~~~~~~
cc1: all warnings being treated as errors
make[2]: *** [../../../Makefile.common:339: exfat_ops.o] Error 1
make[2]: Leaving directory '/var/lib/helenos-ci/nightly/tmp-ci/build/amd64/helenos/uspace/srv/fs/exfat'
make[1]: *** [Makefile:279: srv/fs/exfat.build] Error 2
make[1]: Leaving directory '/var/lib/helenos-ci/nightly/tmp-ci/build/amd64/helenos/uspace'
make: *** [Makefile:61: uspace] Error 2
arm32/beagleboardxm Failed View (tail) 80 s
At top level:
exfat_ops.c:1240:13: error: 'exfat_fsinfo' defined but not used [-Werror=unused-function]
 static void exfat_fsinfo(exfat_bs_t *bs, service_id_t service_id)
             ^~~~~~~~~~~~
cc1: all warnings being treated as errors
make[2]: *** [../../../Makefile.common:339: exfat_ops.o] Error 1
make[2]: Leaving directory '/var/lib/helenos-ci/nightly/tmp-ci/build/arm32-beagleboardxm/helenos/uspace/srv/fs/exfat'
make[1]: *** [Makefile:279: srv/fs/exfat.build] Error 2
make[1]: Leaving directory '/var/lib/helenos-ci/nightly/tmp-ci/build/arm32-beagleboardxm/helenos/uspace'
make: *** [Makefile:61: uspace] Error 2
arm32/beaglebone Failed View (tail) 79 s
At top level:
exfat_ops.c:1240:13: error: 'exfat_fsinfo' defined but not used [-Werror=unused-function]
 static void exfat_fsinfo(exfat_bs_t *bs, service_id_t service_id)
             ^~~~~~~~~~~~
cc1: all warnings being treated as errors
make[2]: *** [../../../Makefile.common:339: exfat_ops.o] Error 1
make[2]: Leaving directory '/var/lib/helenos-ci/nightly/tmp-ci/build/arm32-beaglebone/helenos/uspace/srv/fs/exfat'
make[1]: *** [Makefile:279: srv/fs/exfat.build] Error 2
make[1]: Leaving directory '/var/lib/helenos-ci/nightly/tmp-ci/build/arm32-beaglebone/helenos/uspace'
make: *** [Makefile:61: uspace] Error 2
arm32/gta02 Failed View (tail) 78 s
At top level:
exfat_ops.c:1240:13: error: 'exfat_fsinfo' defined but not used [-Werror=unused-function]
 static void exfat_fsinfo(exfat_bs_t *bs, service_id_t service_id)
             ^~~~~~~~~~~~
cc1: all warnings being treated as errors
make[2]: *** [../../../Makefile.common:339: exfat_ops.o] Error 1
make[2]: Leaving directory '/var/lib/helenos-ci/nightly/tmp-ci/build/arm32-gta02/helenos/uspace/srv/fs/exfat'
make[1]: *** [Makefile:279: srv/fs/exfat.build] Error 2
make[1]: Leaving directory '/var/lib/helenos-ci/nightly/tmp-ci/build/arm32-gta02/helenos/uspace'
make: *** [Makefile:61: uspace] Error 2
arm32/integratorcp Failed View (tail) 79 s
At top level:
exfat_ops.c:1240:13: error: 'exfat_fsinfo' defined but not used [-Werror=unused-function]
 static void exfat_fsinfo(exfat_bs_t *bs, service_id_t service_id)
             ^~~~~~~~~~~~
cc1: all warnings being treated as errors
make[2]: *** [../../../Makefile.common:339: exfat_ops.o] Error 1
make[2]: Leaving directory '/var/lib/helenos-ci/nightly/tmp-ci/build/arm32-integratorcp/helenos/uspace/srv/fs/exfat'
make[1]: *** [Makefile:279: srv/fs/exfat.build] Error 2
make[1]: Leaving directory '/var/lib/helenos-ci/nightly/tmp-ci/build/arm32-integratorcp/helenos/uspace'
make: *** [Makefile:61: uspace] Error 2
arm32/raspberrypi Failed View (tail) 77 s
At top level:
exfat_ops.c:1240:13: error: 'exfat_fsinfo' defined but not used [-Werror=unused-function]
 static void exfat_fsinfo(exfat_bs_t *bs, service_id_t service_id)
             ^~~~~~~~~~~~
cc1: all warnings being treated as errors
make[2]: *** [../../../Makefile.common:339: exfat_ops.o] Error 1
make[2]: Leaving directory '/var/lib/helenos-ci/nightly/tmp-ci/build/arm32-raspberrypi/helenos/uspace/srv/fs/exfat'
make[1]: *** [Makefile:279: srv/fs/exfat.build] Error 2
make[1]: Leaving directory '/var/lib/helenos-ci/nightly/tmp-ci/build/arm32-raspberrypi/helenos/uspace'
make: *** [Makefile:61: uspace] Error 2
ia32 Failed View (tail) 76 s
At top level:
exfat_ops.c:1240:13: error: 'exfat_fsinfo' defined but not used [-Werror=unused-function]
 static void exfat_fsinfo(exfat_bs_t *bs, service_id_t service_id)
             ^~~~~~~~~~~~
cc1: all warnings being treated as errors
make[2]: *** [../../../Makefile.common:339: exfat_ops.o] Error 1
make[2]: Leaving directory '/var/lib/helenos-ci/nightly/tmp-ci/build/ia32/helenos/uspace/srv/fs/exfat'
make[1]: *** [Makefile:279: srv/fs/exfat.build] Error 2
make[1]: Leaving directory '/var/lib/helenos-ci/nightly/tmp-ci/build/ia32/helenos/uspace'
make: *** [Makefile:61: uspace] Error 2
ia64/i460GX Failed View (tail) 2 min 10 s
At top level:
exfat_ops.c:1240:13: error: 'exfat_fsinfo' defined but not used [-Werror=unused-function]
 static void exfat_fsinfo(exfat_bs_t *bs, service_id_t service_id)
             ^~~~~~~~~~~~
cc1: all warnings being treated as errors
make[2]: *** [../../../Makefile.common:339: exfat_ops.o] Error 1
make[2]: Leaving directory '/var/lib/helenos-ci/nightly/tmp-ci/build/ia64-i460GX/helenos/uspace/srv/fs/exfat'
make[1]: *** [Makefile:279: srv/fs/exfat.build] Error 2
make[1]: Leaving directory '/var/lib/helenos-ci/nightly/tmp-ci/build/ia64-i460GX/helenos/uspace'
make: *** [Makefile:61: uspace] Error 2
ia64/ski Failed View (tail) 2 min 7 s
At top level:
exfat_ops.c:1240:13: error: 'exfat_fsinfo' defined but not used [-Werror=unused-function]
 static void exfat_fsinfo(exfat_bs_t *bs, service_id_t service_id)
             ^~~~~~~~~~~~
cc1: all warnings being treated as errors
make[2]: *** [../../../Makefile.common:339: exfat_ops.o] Error 1
make[2]: Leaving directory '/var/lib/helenos-ci/nightly/tmp-ci/build/ia64-ski/helenos/uspace/srv/fs/exfat'
make[1]: *** [Makefile:279: srv/fs/exfat.build] Error 2
make[1]: Leaving directory '/var/lib/helenos-ci/nightly/tmp-ci/build/ia64-ski/helenos/uspace'
make: *** [Makefile:61: uspace] Error 2
mips32/malta-be Failed View (tail) 79 s
At top level:
exfat_ops.c:1240:13: error: 'exfat_fsinfo' defined but not used [-Werror=unused-function]
 static void exfat_fsinfo(exfat_bs_t *bs, service_id_t service_id)
             ^~~~~~~~~~~~
cc1: all warnings being treated as errors
make[2]: *** [../../../Makefile.common:339: exfat_ops.o] Error 1
make[2]: Leaving directory '/var/lib/helenos-ci/nightly/tmp-ci/build/mips32-malta-be/helenos/uspace/srv/fs/exfat'
make[1]: *** [Makefile:279: srv/fs/exfat.build] Error 2
make[1]: Leaving directory '/var/lib/helenos-ci/nightly/tmp-ci/build/mips32-malta-be/helenos/uspace'
make: *** [Makefile:61: uspace] Error 2
mips32/malta-le Failed View (tail) 78 s
At top level:
exfat_ops.c:1240:13: error: 'exfat_fsinfo' defined but not used [-Werror=unused-function]
 static void exfat_fsinfo(exfat_bs_t *bs, service_id_t service_id)
             ^~~~~~~~~~~~
cc1: all warnings being treated as errors
make[2]: *** [../../../Makefile.common:339: exfat_ops.o] Error 1
make[2]: Leaving directory '/var/lib/helenos-ci/nightly/tmp-ci/build/mips32-malta-le/helenos/uspace/srv/fs/exfat'
make[1]: *** [Makefile:279: srv/fs/exfat.build] Error 2
make[1]: Leaving directory '/var/lib/helenos-ci/nightly/tmp-ci/build/mips32-malta-le/helenos/uspace'
make: *** [Makefile:61: uspace] Error 2
mips32/msim Failed View (tail) 77 s
At top level:
exfat_ops.c:1240:13: error: 'exfat_fsinfo' defined but not used [-Werror=unused-function]
 static void exfat_fsinfo(exfat_bs_t *bs, service_id_t service_id)
             ^~~~~~~~~~~~
cc1: all warnings being treated as errors
make[2]: *** [../../../Makefile.common:339: exfat_ops.o] Error 1
make[2]: Leaving directory '/var/lib/helenos-ci/nightly/tmp-ci/build/mips32-msim/helenos/uspace/srv/fs/exfat'
make[1]: *** [Makefile:279: srv/fs/exfat.build] Error 2
make[1]: Leaving directory '/var/lib/helenos-ci/nightly/tmp-ci/build/mips32-msim/helenos/uspace'
make: *** [Makefile:61: uspace] Error 2
ppc32 Failed View (tail) 73 s
At top level:
exfat_ops.c:1240:13: error: 'exfat_fsinfo' defined but not used [-Werror=unused-function]
 static void exfat_fsinfo(exfat_bs_t *bs, service_id_t service_id)
             ^~~~~~~~~~~~
cc1: all warnings being treated as errors
make[2]: *** [../../../Makefile.common:339: exfat_ops.o] Error 1
make[2]: Leaving directory '/var/lib/helenos-ci/nightly/tmp-ci/build/ppc32/helenos/uspace/srv/fs/exfat'
make[1]: *** [Makefile:279: srv/fs/exfat.build] Error 2
make[1]: Leaving directory '/var/lib/helenos-ci/nightly/tmp-ci/build/ppc32/helenos/uspace'
make: *** [Makefile:61: uspace] Error 2
riscv64 Failed View (tail) 68 s
At top level:
exfat_ops.c:1240:13: error: 'exfat_fsinfo' defined but not used [-Werror=unused-function]
 static void exfat_fsinfo(exfat_bs_t *bs, service_id_t service_id)
             ^~~~~~~~~~~~
cc1: all warnings being treated as errors
make[2]: *** [../../../Makefile.common:339: exfat_ops.o] Error 1
make[2]: Leaving directory '/var/lib/helenos-ci/nightly/tmp-ci/build/riscv64/helenos/uspace/srv/fs/exfat'
make[1]: *** [Makefile:279: srv/fs/exfat.build] Error 2
make[1]: Leaving directory '/var/lib/helenos-ci/nightly/tmp-ci/build/riscv64/helenos/uspace'
make: *** [Makefile:61: uspace] Error 2
sparc64/niagara Failed View (tail) 68 s
At top level:
exfat_ops.c:1240:13: error: 'exfat_fsinfo' defined but not used [-Werror=unused-function]
 static void exfat_fsinfo(exfat_bs_t *bs, service_id_t service_id)
             ^~~~~~~~~~~~
cc1: all warnings being treated as errors
make[2]: *** [../../../Makefile.common:339: exfat_ops.o] Error 1
make[2]: Leaving directory '/var/lib/helenos-ci/nightly/tmp-ci/build/sparc64-niagara/helenos/uspace/srv/fs/exfat'
make[1]: *** [Makefile:279: srv/fs/exfat.build] Error 2
make[1]: Leaving directory '/var/lib/helenos-ci/nightly/tmp-ci/build/sparc64-niagara/helenos/uspace'
make: *** [Makefile:61: uspace] Error 2
sparc64/ultra Failed View (tail) 68 s
At top level:
exfat_ops.c:1240:13: error: 'exfat_fsinfo' defined but not used [-Werror=unused-function]
 static void exfat_fsinfo(exfat_bs_t *bs, service_id_t service_id)
             ^~~~~~~~~~~~
cc1: all warnings being treated as errors
make[2]: *** [../../../Makefile.common:339: exfat_ops.o] Error 1
make[2]: Leaving directory '/var/lib/helenos-ci/nightly/tmp-ci/build/sparc64-ultra/helenos/uspace/srv/fs/exfat'
make[1]: *** [Makefile:279: srv/fs/exfat.build] Error 2
make[1]: Leaving directory '/var/lib/helenos-ci/nightly/tmp-ci/build/sparc64-ultra/helenos/uspace'
make: *** [Makefile:61: uspace] Error 2
special/abs32le Failed View (tail) 69 s
At top level:
exfat_ops.c:1240:13: error: 'exfat_fsinfo' defined but not used [-Werror=unused-function]
 static void exfat_fsinfo(exfat_bs_t *bs, service_id_t service_id)
             ^~~~~~~~~~~~
cc1: all warnings being treated as errors
make[2]: *** [../../../Makefile.common:339: exfat_ops.o] Error 1
make[2]: Leaving directory '/var/lib/helenos-ci/nightly/tmp-ci/build/special-abs32le/helenos/uspace/srv/fs/exfat'
make[1]: *** [Makefile:279: srv/fs/exfat.build] Error 2
make[1]: Leaving directory '/var/lib/helenos-ci/nightly/tmp-ci/build/special-abs32le/helenos/uspace'
make: *** [Makefile:61: uspace] Error 2

Per-architecture details (back to top)

amd64(back to top)

Task Result Download Log Duration
HelenOS Failed View (tail) 74 s
At top level:
exfat_ops.c:1240:13: error: 'exfat_fsinfo' defined but not used [-Werror=unused-function]
 static void exfat_fsinfo(exfat_bs_t *bs, service_id_t service_id)
             ^~~~~~~~~~~~
cc1: all warnings being treated as errors
make[2]: *** [../../../Makefile.common:339: exfat_ops.o] Error 1
make[2]: Leaving directory '/var/lib/helenos-ci/nightly/tmp-ci/build/amd64/helenos/uspace/srv/fs/exfat'
make[1]: *** [Makefile:279: srv/fs/exfat.build] Error 2
make[1]: Leaving directory '/var/lib/helenos-ci/nightly/tmp-ci/build/amd64/helenos/uspace'
make: *** [Makefile:61: uspace] Error 2
binutils Skipped View (tail)
Skipped: dependency coastline-prepare-for-amd64 failed (or also skipped).
fdlibm Skipped View (tail)
Skipped: dependency coastline-prepare-for-amd64 failed (or also skipped).
libgmp Skipped View (tail)
Skipped: dependency coastline-prepare-for-amd64 failed (or also skipped).
libiconv Skipped View (tail)
Skipped: dependency coastline-prepare-for-amd64 failed (or also skipped).
msim Skipped View (tail)
Skipped: dependency coastline-prepare-for-amd64 failed (or also skipped).
pcc Skipped View (tail)
Skipped: dependency coastline-prepare-for-amd64 failed (or also skipped).
zlib Skipped View (tail)
Skipped: dependency coastline-prepare-for-amd64 failed (or also skipped).
jainja Skipped View (tail)
Skipped: dependency coastline-build-fdlibm-for-amd64 failed (or also skipped).
libisl Skipped View (tail)
Skipped: dependency coastline-build-libgmp-for-amd64 failed (or also skipped).
libmpfr Skipped View (tail)
Skipped: dependency coastline-build-fdlibm-for-amd64 failed (or also skipped).
libpng Skipped View (tail)
Skipped: dependency coastline-build-zlib-for-amd64 failed (or also skipped).
python2 Skipped View (tail)
Skipped: dependency coastline-build-fdlibm-for-amd64 failed (or also skipped).
libmpc Skipped View (tail)
Skipped: dependency coastline-build-libmpfr-for-amd64 failed (or also skipped).
gcc Skipped View (tail)
Skipped: dependency coastline-build-zlib-for-amd64 failed (or also skipped).
HelenOS with libmpc Skipped View (tail)
Skipped: dependency helenos-build-amd64 failed (or also skipped).
HelenOS with python2 Skipped View (tail)
Skipped: dependency helenos-build-amd64 failed (or also skipped).
HelenOS with zlib Skipped View (tail)
Skipped: dependency helenos-build-amd64 failed (or also skipped).
HelenOS with libisl Skipped View (tail)
Skipped: dependency helenos-build-amd64 failed (or also skipped).
HelenOS with libmpfr Skipped View (tail)
Skipped: dependency helenos-build-amd64 failed (or also skipped).
HelenOS with gcc Skipped View (tail)
Skipped: dependency helenos-build-amd64 failed (or also skipped).
HelenOS with binutils,pcc Skipped View (tail)
Skipped: dependency helenos-build-amd64 failed (or also skipped).
HelenOS with pcc Skipped View (tail)
Skipped: dependency helenos-build-amd64 failed (or also skipped).
HelenOS with libgmp Skipped View (tail)
Skipped: dependency helenos-build-amd64 failed (or also skipped).
HelenOS with libiconv Skipped View (tail)
Skipped: dependency helenos-build-amd64 failed (or also skipped).
HelenOS with libpng Skipped View (tail)
Skipped: dependency helenos-build-amd64 failed (or also skipped).
coast/libmpc/smoke.test Skipped View (tail)
Skipped: dependency extra-amd64-with-libmpc failed (or also skipped).
coast/python2/hello.test Skipped View (tail)
Skipped: dependency extra-amd64-with-python2 failed (or also skipped).
coast/python2/version.test Skipped View (tail)
Skipped: dependency extra-amd64-with-python2 failed (or also skipped).
coast/zlib/minigzip.test Skipped View (tail)
Skipped: dependency extra-amd64-with-zlib failed (or also skipped).
coast/libisl/smoke.test Skipped View (tail)
Skipped: dependency extra-amd64-with-libisl failed (or also skipped).
coast/libmpfr/smoke.test Skipped View (tail)
Skipped: dependency extra-amd64-with-libmpfr failed (or also skipped).
coast/gcc/version.test Skipped View (tail)
Skipped: dependency extra-amd64-with-gcc failed (or also skipped).
coast/pcc/hello.test Skipped View (tail)
Skipped: dependency extra-amd64-with-binutils-pcc failed (or also skipped).
coast/pcc/version.test Skipped View (tail)
Skipped: dependency extra-amd64-with-pcc failed (or also skipped).
coast/libgmp/smoke.test Skipped View (tail)
Skipped: dependency extra-amd64-with-libgmp failed (or also skipped).
coast/libiconv/version.test Skipped View (tail)
Skipped: dependency extra-amd64-with-libiconv failed (or also skipped).
coast/libpng/pngtest.test Skipped View (tail)
Skipped: dependency extra-amd64-with-libpng failed (or also skipped).
base/fs.test Skipped View (tail)
Skipped: dependency helenos-build-amd64 failed (or also skipped).
base/tester_malloc1.test Skipped View (tail)
Skipped: dependency helenos-build-amd64 failed (or also skipped).
boot.test Skipped View (tail)
Skipped: dependency helenos-build-amd64 failed (or also skipped).

arm32/beagleboardxm(back to top)

Task Result Download Log Duration
HelenOS Failed View (tail) 80 s
At top level:
exfat_ops.c:1240:13: error: 'exfat_fsinfo' defined but not used [-Werror=unused-function]
 static void exfat_fsinfo(exfat_bs_t *bs, service_id_t service_id)
             ^~~~~~~~~~~~
cc1: all warnings being treated as errors
make[2]: *** [../../../Makefile.common:339: exfat_ops.o] Error 1
make[2]: Leaving directory '/var/lib/helenos-ci/nightly/tmp-ci/build/arm32-beagleboardxm/helenos/uspace/srv/fs/exfat'
make[1]: *** [Makefile:279: srv/fs/exfat.build] Error 2
make[1]: Leaving directory '/var/lib/helenos-ci/nightly/tmp-ci/build/arm32-beagleboardxm/helenos/uspace'
make: *** [Makefile:61: uspace] Error 2
binutils Skipped View (tail)
Skipped: dependency coastline-prepare-for-arm32-beagleboardxm failed (or also skipped).
fdlibm Skipped View (tail)
Skipped: dependency coastline-prepare-for-arm32-beagleboardxm failed (or also skipped).
libgmp Skipped View (tail)
Skipped: dependency coastline-prepare-for-arm32-beagleboardxm failed (or also skipped).
libiconv Skipped View (tail)
Skipped: dependency coastline-prepare-for-arm32-beagleboardxm failed (or also skipped).
msim Skipped View (tail)
Skipped: dependency coastline-prepare-for-arm32-beagleboardxm failed (or also skipped).
pcc Skipped View (tail)
Skipped: dependency coastline-prepare-for-arm32-beagleboardxm failed (or also skipped).
zlib Skipped View (tail)
Skipped: dependency coastline-prepare-for-arm32-beagleboardxm failed (or also skipped).
jainja Skipped View (tail)
Skipped: dependency coastline-build-fdlibm-for-arm32-beagleboardxm failed (or also skipped).
libisl Skipped View (tail)
Skipped: dependency coastline-build-libgmp-for-arm32-beagleboardxm failed (or also skipped).
libmpfr Skipped View (tail)
Skipped: dependency coastline-build-fdlibm-for-arm32-beagleboardxm failed (or also skipped).
libpng Skipped View (tail)
Skipped: dependency coastline-build-zlib-for-arm32-beagleboardxm failed (or also skipped).
python2 Skipped View (tail)
Skipped: dependency coastline-build-fdlibm-for-arm32-beagleboardxm failed (or also skipped).
libmpc Skipped View (tail)
Skipped: dependency coastline-build-libmpfr-for-arm32-beagleboardxm failed (or also skipped).
gcc Skipped View (tail)
Skipped: dependency coastline-build-zlib-for-arm32-beagleboardxm failed (or also skipped).

arm32/beaglebone(back to top)

Task Result Download Log Duration
HelenOS Failed View (tail) 79 s
At top level:
exfat_ops.c:1240:13: error: 'exfat_fsinfo' defined but not used [-Werror=unused-function]
 static void exfat_fsinfo(exfat_bs_t *bs, service_id_t service_id)
             ^~~~~~~~~~~~
cc1: all warnings being treated as errors
make[2]: *** [../../../Makefile.common:339: exfat_ops.o] Error 1
make[2]: Leaving directory '/var/lib/helenos-ci/nightly/tmp-ci/build/arm32-beaglebone/helenos/uspace/srv/fs/exfat'
make[1]: *** [Makefile:279: srv/fs/exfat.build] Error 2
make[1]: Leaving directory '/var/lib/helenos-ci/nightly/tmp-ci/build/arm32-beaglebone/helenos/uspace'
make: *** [Makefile:61: uspace] Error 2
binutils Skipped View (tail)
Skipped: dependency coastline-prepare-for-arm32-beaglebone failed (or also skipped).
fdlibm Skipped View (tail)
Skipped: dependency coastline-prepare-for-arm32-beaglebone failed (or also skipped).
libgmp Skipped View (tail)
Skipped: dependency coastline-prepare-for-arm32-beaglebone failed (or also skipped).
libiconv Skipped View (tail)
Skipped: dependency coastline-prepare-for-arm32-beaglebone failed (or also skipped).
msim Skipped View (tail)
Skipped: dependency coastline-prepare-for-arm32-beaglebone failed (or also skipped).
pcc Skipped View (tail)
Skipped: dependency coastline-prepare-for-arm32-beaglebone failed (or also skipped).
zlib Skipped View (tail)
Skipped: dependency coastline-prepare-for-arm32-beaglebone failed (or also skipped).
jainja Skipped View (tail)
Skipped: dependency coastline-build-fdlibm-for-arm32-beaglebone failed (or also skipped).
libisl Skipped View (tail)
Skipped: dependency coastline-build-libgmp-for-arm32-beaglebone failed (or also skipped).
libmpfr Skipped View (tail)
Skipped: dependency coastline-build-fdlibm-for-arm32-beaglebone failed (or also skipped).
libpng Skipped View (tail)
Skipped: dependency coastline-build-zlib-for-arm32-beaglebone failed (or also skipped).
python2 Skipped View (tail)
Skipped: dependency coastline-build-fdlibm-for-arm32-beaglebone failed (or also skipped).
libmpc Skipped View (tail)
Skipped: dependency coastline-build-libmpfr-for-arm32-beaglebone failed (or also skipped).
gcc Skipped View (tail)
Skipped: dependency coastline-build-zlib-for-arm32-beaglebone failed (or also skipped).

arm32/gta02(back to top)

Task Result Download Log Duration
HelenOS Failed View (tail) 78 s
At top level:
exfat_ops.c:1240:13: error: 'exfat_fsinfo' defined but not used [-Werror=unused-function]
 static void exfat_fsinfo(exfat_bs_t *bs, service_id_t service_id)
             ^~~~~~~~~~~~
cc1: all warnings being treated as errors
make[2]: *** [../../../Makefile.common:339: exfat_ops.o] Error 1
make[2]: Leaving directory '/var/lib/helenos-ci/nightly/tmp-ci/build/arm32-gta02/helenos/uspace/srv/fs/exfat'
make[1]: *** [Makefile:279: srv/fs/exfat.build] Error 2
make[1]: Leaving directory '/var/lib/helenos-ci/nightly/tmp-ci/build/arm32-gta02/helenos/uspace'
make: *** [Makefile:61: uspace] Error 2
binutils Skipped View (tail)
Skipped: dependency coastline-prepare-for-arm32-gta02 failed (or also skipped).
fdlibm Skipped View (tail)
Skipped: dependency coastline-prepare-for-arm32-gta02 failed (or also skipped).
libgmp Skipped View (tail)
Skipped: dependency coastline-prepare-for-arm32-gta02 failed (or also skipped).
libiconv Skipped View (tail)
Skipped: dependency coastline-prepare-for-arm32-gta02 failed (or also skipped).
msim Skipped View (tail)
Skipped: dependency coastline-prepare-for-arm32-gta02 failed (or also skipped).
pcc Skipped View (tail)
Skipped: dependency coastline-prepare-for-arm32-gta02 failed (or also skipped).
zlib Skipped View (tail)
Skipped: dependency coastline-prepare-for-arm32-gta02 failed (or also skipped).
jainja Skipped View (tail)
Skipped: dependency coastline-build-fdlibm-for-arm32-gta02 failed (or also skipped).
libisl Skipped View (tail)
Skipped: dependency coastline-build-libgmp-for-arm32-gta02 failed (or also skipped).
libmpfr Skipped View (tail)
Skipped: dependency coastline-build-fdlibm-for-arm32-gta02 failed (or also skipped).
libpng Skipped View (tail)
Skipped: dependency coastline-build-zlib-for-arm32-gta02 failed (or also skipped).
python2 Skipped View (tail)
Skipped: dependency coastline-build-fdlibm-for-arm32-gta02 failed (or also skipped).
libmpc Skipped View (tail)
Skipped: dependency coastline-build-libmpfr-for-arm32-gta02 failed (or also skipped).
gcc Skipped View (tail)
Skipped: dependency coastline-build-zlib-for-arm32-gta02 failed (or also skipped).

arm32/integratorcp(back to top)

Task Result Download Log Duration
HelenOS Failed View (tail) 79 s
At top level:
exfat_ops.c:1240:13: error: 'exfat_fsinfo' defined but not used [-Werror=unused-function]
 static void exfat_fsinfo(exfat_bs_t *bs, service_id_t service_id)
             ^~~~~~~~~~~~
cc1: all warnings being treated as errors
make[2]: *** [../../../Makefile.common:339: exfat_ops.o] Error 1
make[2]: Leaving directory '/var/lib/helenos-ci/nightly/tmp-ci/build/arm32-integratorcp/helenos/uspace/srv/fs/exfat'
make[1]: *** [Makefile:279: srv/fs/exfat.build] Error 2
make[1]: Leaving directory '/var/lib/helenos-ci/nightly/tmp-ci/build/arm32-integratorcp/helenos/uspace'
make: *** [Makefile:61: uspace] Error 2
binutils Skipped View (tail)
Skipped: dependency coastline-prepare-for-arm32-integratorcp failed (or also skipped).
fdlibm Skipped View (tail)
Skipped: dependency coastline-prepare-for-arm32-integratorcp failed (or also skipped).
libgmp Skipped View (tail)
Skipped: dependency coastline-prepare-for-arm32-integratorcp failed (or also skipped).
libiconv Skipped View (tail)
Skipped: dependency coastline-prepare-for-arm32-integratorcp failed (or also skipped).
msim Skipped View (tail)
Skipped: dependency coastline-prepare-for-arm32-integratorcp failed (or also skipped).
pcc Skipped View (tail)
Skipped: dependency coastline-prepare-for-arm32-integratorcp failed (or also skipped).
zlib Skipped View (tail)
Skipped: dependency coastline-prepare-for-arm32-integratorcp failed (or also skipped).
jainja Skipped View (tail)
Skipped: dependency coastline-build-fdlibm-for-arm32-integratorcp failed (or also skipped).
libisl Skipped View (tail)
Skipped: dependency coastline-build-libgmp-for-arm32-integratorcp failed (or also skipped).
libmpfr Skipped View (tail)
Skipped: dependency coastline-build-fdlibm-for-arm32-integratorcp failed (or also skipped).
libpng Skipped View (tail)
Skipped: dependency coastline-build-zlib-for-arm32-integratorcp failed (or also skipped).
python2 Skipped View (tail)
Skipped: dependency coastline-build-fdlibm-for-arm32-integratorcp failed (or also skipped).
libmpc Skipped View (tail)
Skipped: dependency coastline-build-libmpfr-for-arm32-integratorcp failed (or also skipped).
gcc Skipped View (tail)
Skipped: dependency coastline-build-zlib-for-arm32-integratorcp failed (or also skipped).
HelenOS with libmpc Skipped View (tail)
Skipped: dependency helenos-build-arm32-integratorcp failed (or also skipped).
HelenOS with python2 Skipped View (tail)
Skipped: dependency helenos-build-arm32-integratorcp failed (or also skipped).
HelenOS with zlib Skipped View (tail)
Skipped: dependency helenos-build-arm32-integratorcp failed (or also skipped).
HelenOS with libisl Skipped View (tail)
Skipped: dependency helenos-build-arm32-integratorcp failed (or also skipped).
HelenOS with libmpfr Skipped View (tail)
Skipped: dependency helenos-build-arm32-integratorcp failed (or also skipped).
HelenOS with gcc Skipped View (tail)
Skipped: dependency helenos-build-arm32-integratorcp failed (or also skipped).
HelenOS with binutils,pcc Skipped View (tail)
Skipped: dependency helenos-build-arm32-integratorcp failed (or also skipped).
HelenOS with pcc Skipped View (tail)
Skipped: dependency helenos-build-arm32-integratorcp failed (or also skipped).
HelenOS with libgmp Skipped View (tail)
Skipped: dependency helenos-build-arm32-integratorcp failed (or also skipped).
HelenOS with libiconv Skipped View (tail)
Skipped: dependency helenos-build-arm32-integratorcp failed (or also skipped).
HelenOS with libpng Skipped View (tail)
Skipped: dependency helenos-build-arm32-integratorcp failed (or also skipped).
coast/libmpc/smoke.test Skipped View (tail)
Skipped: dependency extra-arm32-integratorcp-with-libmpc failed (or also skipped).
coast/python2/hello.test Skipped View (tail)
Skipped: dependency extra-arm32-integratorcp-with-python2 failed (or also skipped).
coast/python2/version.test Skipped View (tail)
Skipped: dependency extra-arm32-integratorcp-with-python2 failed (or also skipped).
coast/zlib/minigzip.test Skipped View (tail)
Skipped: dependency extra-arm32-integratorcp-with-zlib failed (or also skipped).
coast/libisl/smoke.test Skipped View (tail)
Skipped: dependency extra-arm32-integratorcp-with-libisl failed (or also skipped).
coast/libmpfr/smoke.test Skipped View (tail)
Skipped: dependency extra-arm32-integratorcp-with-libmpfr failed (or also skipped).
coast/gcc/version.test Skipped View (tail)
Skipped: dependency extra-arm32-integratorcp-with-gcc failed (or also skipped).
coast/pcc/hello.test Skipped View (tail)
Skipped: dependency extra-arm32-integratorcp-with-binutils-pcc failed (or also skipped).
coast/pcc/version.test Skipped View (tail)
Skipped: dependency extra-arm32-integratorcp-with-pcc failed (or also skipped).
coast/libgmp/smoke.test Skipped View (tail)
Skipped: dependency extra-arm32-integratorcp-with-libgmp failed (or also skipped).
coast/libiconv/version.test Skipped View (tail)
Skipped: dependency extra-arm32-integratorcp-with-libiconv failed (or also skipped).
coast/libpng/pngtest.test Skipped View (tail)
Skipped: dependency extra-arm32-integratorcp-with-libpng failed (or also skipped).
base/fs.test Skipped View (tail)
Skipped: dependency helenos-build-arm32-integratorcp failed (or also skipped).
base/tester_malloc1.test Skipped View (tail)
Skipped: dependency helenos-build-arm32-integratorcp failed (or also skipped).
boot.test Skipped View (tail)
Skipped: dependency helenos-build-arm32-integratorcp failed (or also skipped).

arm32/raspberrypi(back to top)

Task Result Download Log Duration
HelenOS Failed View (tail) 77 s
At top level:
exfat_ops.c:1240:13: error: 'exfat_fsinfo' defined but not used [-Werror=unused-function]
 static void exfat_fsinfo(exfat_bs_t *bs, service_id_t service_id)
             ^~~~~~~~~~~~
cc1: all warnings being treated as errors
make[2]: *** [../../../Makefile.common:339: exfat_ops.o] Error 1
make[2]: Leaving directory '/var/lib/helenos-ci/nightly/tmp-ci/build/arm32-raspberrypi/helenos/uspace/srv/fs/exfat'
make[1]: *** [Makefile:279: srv/fs/exfat.build] Error 2
make[1]: Leaving directory '/var/lib/helenos-ci/nightly/tmp-ci/build/arm32-raspberrypi/helenos/uspace'
make: *** [Makefile:61: uspace] Error 2
binutils Skipped View (tail)
Skipped: dependency coastline-prepare-for-arm32-raspberrypi failed (or also skipped).
fdlibm Skipped View (tail)
Skipped: dependency coastline-prepare-for-arm32-raspberrypi failed (or also skipped).
libgmp Skipped View (tail)
Skipped: dependency coastline-prepare-for-arm32-raspberrypi failed (or also skipped).
libiconv Skipped View (tail)
Skipped: dependency coastline-prepare-for-arm32-raspberrypi failed (or also skipped).
msim Skipped View (tail)
Skipped: dependency coastline-prepare-for-arm32-raspberrypi failed (or also skipped).
pcc Skipped View (tail)
Skipped: dependency coastline-prepare-for-arm32-raspberrypi failed (or also skipped).
zlib Skipped View (tail)
Skipped: dependency coastline-prepare-for-arm32-raspberrypi failed (or also skipped).
jainja Skipped View (tail)
Skipped: dependency coastline-build-fdlibm-for-arm32-raspberrypi failed (or also skipped).
libisl Skipped View (tail)
Skipped: dependency coastline-build-libgmp-for-arm32-raspberrypi failed (or also skipped).
libmpfr Skipped View (tail)
Skipped: dependency coastline-build-fdlibm-for-arm32-raspberrypi failed (or also skipped).
libpng Skipped View (tail)
Skipped: dependency coastline-build-zlib-for-arm32-raspberrypi failed (or also skipped).
python2 Skipped View (tail)
Skipped: dependency coastline-build-fdlibm-for-arm32-raspberrypi failed (or also skipped).
libmpc Skipped View (tail)
Skipped: dependency coastline-build-libmpfr-for-arm32-raspberrypi failed (or also skipped).
gcc Skipped View (tail)
Skipped: dependency coastline-build-zlib-for-arm32-raspberrypi failed (or also skipped).

ia32(back to top)

Task Result Download Log Duration
HelenOS Failed View (tail) 76 s
At top level:
exfat_ops.c:1240:13: error: 'exfat_fsinfo' defined but not used [-Werror=unused-function]
 static void exfat_fsinfo(exfat_bs_t *bs, service_id_t service_id)
             ^~~~~~~~~~~~
cc1: all warnings being treated as errors
make[2]: *** [../../../Makefile.common:339: exfat_ops.o] Error 1
make[2]: Leaving directory '/var/lib/helenos-ci/nightly/tmp-ci/build/ia32/helenos/uspace/srv/fs/exfat'
make[1]: *** [Makefile:279: srv/fs/exfat.build] Error 2
make[1]: Leaving directory '/var/lib/helenos-ci/nightly/tmp-ci/build/ia32/helenos/uspace'
make: *** [Makefile:61: uspace] Error 2
binutils Skipped View (tail)
Skipped: dependency coastline-prepare-for-ia32 failed (or also skipped).
fdlibm Skipped View (tail)
Skipped: dependency coastline-prepare-for-ia32 failed (or also skipped).
libgmp Skipped View (tail)
Skipped: dependency coastline-prepare-for-ia32 failed (or also skipped).
libiconv Skipped View (tail)
Skipped: dependency coastline-prepare-for-ia32 failed (or also skipped).
msim Skipped View (tail)
Skipped: dependency coastline-prepare-for-ia32 failed (or also skipped).
pcc Skipped View (tail)
Skipped: dependency coastline-prepare-for-ia32 failed (or also skipped).
zlib Skipped View (tail)
Skipped: dependency coastline-prepare-for-ia32 failed (or also skipped).
jainja Skipped View (tail)
Skipped: dependency coastline-build-fdlibm-for-ia32 failed (or also skipped).
libisl Skipped View (tail)
Skipped: dependency coastline-build-libgmp-for-ia32 failed (or also skipped).
libmpfr Skipped View (tail)
Skipped: dependency coastline-build-fdlibm-for-ia32 failed (or also skipped).
libpng Skipped View (tail)
Skipped: dependency coastline-build-zlib-for-ia32 failed (or also skipped).
python2 Skipped View (tail)
Skipped: dependency coastline-build-fdlibm-for-ia32 failed (or also skipped).
libmpc Skipped View (tail)
Skipped: dependency coastline-build-libmpfr-for-ia32 failed (or also skipped).
gcc Skipped View (tail)
Skipped: dependency coastline-build-zlib-for-ia32 failed (or also skipped).
HelenOS with libmpc Skipped View (tail)
Skipped: dependency helenos-build-ia32 failed (or also skipped).
HelenOS with python2 Skipped View (tail)
Skipped: dependency helenos-build-ia32 failed (or also skipped).
HelenOS with zlib Skipped View (tail)
Skipped: dependency helenos-build-ia32 failed (or also skipped).
HelenOS with libisl Skipped View (tail)
Skipped: dependency helenos-build-ia32 failed (or also skipped).
HelenOS with libmpfr Skipped View (tail)
Skipped: dependency helenos-build-ia32 failed (or also skipped).
HelenOS with gcc Skipped View (tail)
Skipped: dependency helenos-build-ia32 failed (or also skipped).
HelenOS with binutils,pcc Skipped View (tail)
Skipped: dependency helenos-build-ia32 failed (or also skipped).
HelenOS with pcc Skipped View (tail)
Skipped: dependency helenos-build-ia32 failed (or also skipped).
HelenOS with libgmp Skipped View (tail)
Skipped: dependency helenos-build-ia32 failed (or also skipped).
HelenOS with libiconv Skipped View (tail)
Skipped: dependency helenos-build-ia32 failed (or also skipped).
HelenOS with libpng Skipped View (tail)
Skipped: dependency helenos-build-ia32 failed (or also skipped).
coast/libmpc/smoke.test Skipped View (tail)
Skipped: dependency extra-ia32-with-libmpc failed (or also skipped).
coast/python2/hello.test Skipped View (tail)
Skipped: dependency extra-ia32-with-python2 failed (or also skipped).
coast/python2/version.test Skipped View (tail)
Skipped: dependency extra-ia32-with-python2 failed (or also skipped).
coast/zlib/minigzip.test Skipped View (tail)
Skipped: dependency extra-ia32-with-zlib failed (or also skipped).
coast/libisl/smoke.test Skipped View (tail)
Skipped: dependency extra-ia32-with-libisl failed (or also skipped).
coast/libmpfr/smoke.test Skipped View (tail)
Skipped: dependency extra-ia32-with-libmpfr failed (or also skipped).
coast/gcc/version.test Skipped View (tail)
Skipped: dependency extra-ia32-with-gcc failed (or also skipped).
coast/pcc/hello.test Skipped View (tail)
Skipped: dependency extra-ia32-with-binutils-pcc failed (or also skipped).
coast/pcc/version.test Skipped View (tail)
Skipped: dependency extra-ia32-with-pcc failed (or also skipped).
coast/libgmp/smoke.test Skipped View (tail)
Skipped: dependency extra-ia32-with-libgmp failed (or also skipped).
coast/libiconv/version.test Skipped View (tail)
Skipped: dependency extra-ia32-with-libiconv failed (or also skipped).
coast/libpng/pngtest.test Skipped View (tail)
Skipped: dependency extra-ia32-with-libpng failed (or also skipped).
base/fs.test Skipped View (tail)
Skipped: dependency helenos-build-ia32 failed (or also skipped).
base/tester_malloc1.test Skipped View (tail)
Skipped: dependency helenos-build-ia32 failed (or also skipped).
boot.test Skipped View (tail)
Skipped: dependency helenos-build-ia32 failed (or also skipped).

ia64/i460GX(back to top)

Task Result Download Log Duration
HelenOS Failed View (tail) 2 min 10 s
At top level:
exfat_ops.c:1240:13: error: 'exfat_fsinfo' defined but not used [-Werror=unused-function]
 static void exfat_fsinfo(exfat_bs_t *bs, service_id_t service_id)
             ^~~~~~~~~~~~
cc1: all warnings being treated as errors
make[2]: *** [../../../Makefile.common:339: exfat_ops.o] Error 1
make[2]: Leaving directory '/var/lib/helenos-ci/nightly/tmp-ci/build/ia64-i460GX/helenos/uspace/srv/fs/exfat'
make[1]: *** [Makefile:279: srv/fs/exfat.build] Error 2
make[1]: Leaving directory '/var/lib/helenos-ci/nightly/tmp-ci/build/ia64-i460GX/helenos/uspace'
make: *** [Makefile:61: uspace] Error 2
binutils Skipped View (tail)
Skipped: dependency coastline-prepare-for-ia64-i460GX failed (or also skipped).
fdlibm Skipped View (tail)
Skipped: dependency coastline-prepare-for-ia64-i460GX failed (or also skipped).
libgmp Skipped View (tail)
Skipped: dependency coastline-prepare-for-ia64-i460GX failed (or also skipped).
libiconv Skipped View (tail)
Skipped: dependency coastline-prepare-for-ia64-i460GX failed (or also skipped).
msim Skipped View (tail)
Skipped: dependency coastline-prepare-for-ia64-i460GX failed (or also skipped).
pcc Skipped View (tail)
Skipped: dependency coastline-prepare-for-ia64-i460GX failed (or also skipped).
zlib Skipped View (tail)
Skipped: dependency coastline-prepare-for-ia64-i460GX failed (or also skipped).
jainja Skipped View (tail)
Skipped: dependency coastline-build-fdlibm-for-ia64-i460GX failed (or also skipped).
libisl Skipped View (tail)
Skipped: dependency coastline-build-libgmp-for-ia64-i460GX failed (or also skipped).
libmpfr Skipped View (tail)
Skipped: dependency coastline-build-fdlibm-for-ia64-i460GX failed (or also skipped).
libpng Skipped View (tail)
Skipped: dependency coastline-build-zlib-for-ia64-i460GX failed (or also skipped).
python2 Skipped View (tail)
Skipped: dependency coastline-build-fdlibm-for-ia64-i460GX failed (or also skipped).
libmpc Skipped View (tail)
Skipped: dependency coastline-build-libmpfr-for-ia64-i460GX failed (or also skipped).
gcc Skipped View (tail)
Skipped: dependency coastline-build-zlib-for-ia64-i460GX failed (or also skipped).

ia64/ski(back to top)

Task Result Download Log Duration
HelenOS Failed View (tail) 2 min 7 s
At top level:
exfat_ops.c:1240:13: error: 'exfat_fsinfo' defined but not used [-Werror=unused-function]
 static void exfat_fsinfo(exfat_bs_t *bs, service_id_t service_id)
             ^~~~~~~~~~~~
cc1: all warnings being treated as errors
make[2]: *** [../../../Makefile.common:339: exfat_ops.o] Error 1
make[2]: Leaving directory '/var/lib/helenos-ci/nightly/tmp-ci/build/ia64-ski/helenos/uspace/srv/fs/exfat'
make[1]: *** [Makefile:279: srv/fs/exfat.build] Error 2
make[1]: Leaving directory '/var/lib/helenos-ci/nightly/tmp-ci/build/ia64-ski/helenos/uspace'
make: *** [Makefile:61: uspace] Error 2
binutils Skipped View (tail)
Skipped: dependency coastline-prepare-for-ia64-ski failed (or also skipped).
fdlibm Skipped View (tail)
Skipped: dependency coastline-prepare-for-ia64-ski failed (or also skipped).
libgmp Skipped View (tail)
Skipped: dependency coastline-prepare-for-ia64-ski failed (or also skipped).
libiconv Skipped View (tail)
Skipped: dependency coastline-prepare-for-ia64-ski failed (or also skipped).
msim Skipped View (tail)
Skipped: dependency coastline-prepare-for-ia64-ski failed (or also skipped).
pcc Skipped View (tail)
Skipped: dependency coastline-prepare-for-ia64-ski failed (or also skipped).
zlib Skipped View (tail)
Skipped: dependency coastline-prepare-for-ia64-ski failed (or also skipped).
jainja Skipped View (tail)
Skipped: dependency coastline-build-fdlibm-for-ia64-ski failed (or also skipped).
libisl Skipped View (tail)
Skipped: dependency coastline-build-libgmp-for-ia64-ski failed (or also skipped).
libmpfr Skipped View (tail)
Skipped: dependency coastline-build-fdlibm-for-ia64-ski failed (or also skipped).
libpng Skipped View (tail)
Skipped: dependency coastline-build-zlib-for-ia64-ski failed (or also skipped).
python2 Skipped View (tail)
Skipped: dependency coastline-build-fdlibm-for-ia64-ski failed (or also skipped).
libmpc Skipped View (tail)
Skipped: dependency coastline-build-libmpfr-for-ia64-ski failed (or also skipped).
gcc Skipped View (tail)
Skipped: dependency coastline-build-zlib-for-ia64-ski failed (or also skipped).

mips32/malta-be(back to top)

Task Result Download Log Duration
HelenOS Failed View (tail) 79 s
At top level:
exfat_ops.c:1240:13: error: 'exfat_fsinfo' defined but not used [-Werror=unused-function]
 static void exfat_fsinfo(exfat_bs_t *bs, service_id_t service_id)
             ^~~~~~~~~~~~
cc1: all warnings being treated as errors
make[2]: *** [../../../Makefile.common:339: exfat_ops.o] Error 1
make[2]: Leaving directory '/var/lib/helenos-ci/nightly/tmp-ci/build/mips32-malta-be/helenos/uspace/srv/fs/exfat'
make[1]: *** [Makefile:279: srv/fs/exfat.build] Error 2
make[1]: Leaving directory '/var/lib/helenos-ci/nightly/tmp-ci/build/mips32-malta-be/helenos/uspace'
make: *** [Makefile:61: uspace] Error 2
binutils Skipped View (tail)
Skipped: dependency coastline-prepare-for-mips32-malta-be failed (or also skipped).
fdlibm Skipped View (tail)
Skipped: dependency coastline-prepare-for-mips32-malta-be failed (or also skipped).
libgmp Skipped View (tail)
Skipped: dependency coastline-prepare-for-mips32-malta-be failed (or also skipped).
libiconv Skipped View (tail)
Skipped: dependency coastline-prepare-for-mips32-malta-be failed (or also skipped).
msim Skipped View (tail)
Skipped: dependency coastline-prepare-for-mips32-malta-be failed (or also skipped).
pcc Skipped View (tail)
Skipped: dependency coastline-prepare-for-mips32-malta-be failed (or also skipped).
zlib Skipped View (tail)
Skipped: dependency coastline-prepare-for-mips32-malta-be failed (or also skipped).
jainja Skipped View (tail)
Skipped: dependency coastline-build-fdlibm-for-mips32-malta-be failed (or also skipped).
libisl Skipped View (tail)
Skipped: dependency coastline-build-libgmp-for-mips32-malta-be failed (or also skipped).
libmpfr Skipped View (tail)
Skipped: dependency coastline-build-fdlibm-for-mips32-malta-be failed (or also skipped).
libpng Skipped View (tail)
Skipped: dependency coastline-build-zlib-for-mips32-malta-be failed (or also skipped).
python2 Skipped View (tail)
Skipped: dependency coastline-build-fdlibm-for-mips32-malta-be failed (or also skipped).
libmpc Skipped View (tail)
Skipped: dependency coastline-build-libmpfr-for-mips32-malta-be failed (or also skipped).
gcc Skipped View (tail)
Skipped: dependency coastline-build-zlib-for-mips32-malta-be failed (or also skipped).

mips32/malta-le(back to top)

Task Result Download Log Duration
HelenOS Failed View (tail) 78 s
At top level:
exfat_ops.c:1240:13: error: 'exfat_fsinfo' defined but not used [-Werror=unused-function]
 static void exfat_fsinfo(exfat_bs_t *bs, service_id_t service_id)
             ^~~~~~~~~~~~
cc1: all warnings being treated as errors
make[2]: *** [../../../Makefile.common:339: exfat_ops.o] Error 1
make[2]: Leaving directory '/var/lib/helenos-ci/nightly/tmp-ci/build/mips32-malta-le/helenos/uspace/srv/fs/exfat'
make[1]: *** [Makefile:279: srv/fs/exfat.build] Error 2
make[1]: Leaving directory '/var/lib/helenos-ci/nightly/tmp-ci/build/mips32-malta-le/helenos/uspace'
make: *** [Makefile:61: uspace] Error 2
binutils Skipped View (tail)
Skipped: dependency coastline-prepare-for-mips32-malta-le failed (or also skipped).
fdlibm Skipped View (tail)
Skipped: dependency coastline-prepare-for-mips32-malta-le failed (or also skipped).
libgmp Skipped View (tail)
Skipped: dependency coastline-prepare-for-mips32-malta-le failed (or also skipped).
libiconv Skipped View (tail)
Skipped: dependency coastline-prepare-for-mips32-malta-le failed (or also skipped).
msim Skipped View (tail)
Skipped: dependency coastline-prepare-for-mips32-malta-le failed (or also skipped).
pcc Skipped View (tail)
Skipped: dependency coastline-prepare-for-mips32-malta-le failed (or also skipped).
zlib Skipped View (tail)
Skipped: dependency coastline-prepare-for-mips32-malta-le failed (or also skipped).
jainja Skipped View (tail)
Skipped: dependency coastline-build-fdlibm-for-mips32-malta-le failed (or also skipped).
libisl Skipped View (tail)
Skipped: dependency coastline-build-libgmp-for-mips32-malta-le failed (or also skipped).
libmpfr Skipped View (tail)
Skipped: dependency coastline-build-fdlibm-for-mips32-malta-le failed (or also skipped).
libpng Skipped View (tail)
Skipped: dependency coastline-build-zlib-for-mips32-malta-le failed (or also skipped).
python2 Skipped View (tail)
Skipped: dependency coastline-build-fdlibm-for-mips32-malta-le failed (or also skipped).
libmpc Skipped View (tail)
Skipped: dependency coastline-build-libmpfr-for-mips32-malta-le failed (or also skipped).
gcc Skipped View (tail)
Skipped: dependency coastline-build-zlib-for-mips32-malta-le failed (or also skipped).

mips32/msim(back to top)

Task Result Download Log Duration
HelenOS Failed View (tail) 77 s
At top level:
exfat_ops.c:1240:13: error: 'exfat_fsinfo' defined but not used [-Werror=unused-function]
 static void exfat_fsinfo(exfat_bs_t *bs, service_id_t service_id)
             ^~~~~~~~~~~~
cc1: all warnings being treated as errors
make[2]: *** [../../../Makefile.common:339: exfat_ops.o] Error 1
make[2]: Leaving directory '/var/lib/helenos-ci/nightly/tmp-ci/build/mips32-msim/helenos/uspace/srv/fs/exfat'
make[1]: *** [Makefile:279: srv/fs/exfat.build] Error 2
make[1]: Leaving directory '/var/lib/helenos-ci/nightly/tmp-ci/build/mips32-msim/helenos/uspace'
make: *** [Makefile:61: uspace] Error 2
binutils Skipped View (tail)
Skipped: dependency coastline-prepare-for-mips32-msim failed (or also skipped).
fdlibm Skipped View (tail)
Skipped: dependency coastline-prepare-for-mips32-msim failed (or also skipped).
libgmp Skipped View (tail)
Skipped: dependency coastline-prepare-for-mips32-msim failed (or also skipped).
libiconv Skipped View (tail)
Skipped: dependency coastline-prepare-for-mips32-msim failed (or also skipped).
msim Skipped View (tail)
Skipped: dependency coastline-prepare-for-mips32-msim failed (or also skipped).
pcc Skipped View (tail)
Skipped: dependency coastline-prepare-for-mips32-msim failed (or also skipped).
zlib Skipped View (tail)
Skipped: dependency coastline-prepare-for-mips32-msim failed (or also skipped).
jainja Skipped View (tail)
Skipped: dependency coastline-build-fdlibm-for-mips32-msim failed (or also skipped).
libisl Skipped View (tail)
Skipped: dependency coastline-build-libgmp-for-mips32-msim failed (or also skipped).
libmpfr Skipped View (tail)
Skipped: dependency coastline-build-fdlibm-for-mips32-msim failed (or also skipped).
libpng Skipped View (tail)
Skipped: dependency coastline-build-zlib-for-mips32-msim failed (or also skipped).
python2 Skipped View (tail)
Skipped: dependency coastline-build-fdlibm-for-mips32-msim failed (or also skipped).
libmpc Skipped View (tail)
Skipped: dependency coastline-build-libmpfr-for-mips32-msim failed (or also skipped).
gcc Skipped View (tail)
Skipped: dependency coastline-build-zlib-for-mips32-msim failed (or also skipped).

ppc32(back to top)

Task Result Download Log Duration
HelenOS Failed View (tail) 73 s
At top level:
exfat_ops.c:1240:13: error: 'exfat_fsinfo' defined but not used [-Werror=unused-function]
 static void exfat_fsinfo(exfat_bs_t *bs, service_id_t service_id)
             ^~~~~~~~~~~~
cc1: all warnings being treated as errors
make[2]: *** [../../../Makefile.common:339: exfat_ops.o] Error 1
make[2]: Leaving directory '/var/lib/helenos-ci/nightly/tmp-ci/build/ppc32/helenos/uspace/srv/fs/exfat'
make[1]: *** [Makefile:279: srv/fs/exfat.build] Error 2
make[1]: Leaving directory '/var/lib/helenos-ci/nightly/tmp-ci/build/ppc32/helenos/uspace'
make: *** [Makefile:61: uspace] Error 2
binutils Skipped View (tail)
Skipped: dependency coastline-prepare-for-ppc32 failed (or also skipped).
fdlibm Skipped View (tail)
Skipped: dependency coastline-prepare-for-ppc32 failed (or also skipped).
libgmp Skipped View (tail)
Skipped: dependency coastline-prepare-for-ppc32 failed (or also skipped).
libiconv Skipped View (tail)
Skipped: dependency coastline-prepare-for-ppc32 failed (or also skipped).
msim Skipped View (tail)
Skipped: dependency coastline-prepare-for-ppc32 failed (or also skipped).
pcc Skipped View (tail)
Skipped: dependency coastline-prepare-for-ppc32 failed (or also skipped).
zlib Skipped View (tail)
Skipped: dependency coastline-prepare-for-ppc32 failed (or also skipped).
jainja Skipped View (tail)
Skipped: dependency coastline-build-fdlibm-for-ppc32 failed (or also skipped).
libisl Skipped View (tail)
Skipped: dependency coastline-build-libgmp-for-ppc32 failed (or also skipped).
libmpfr Skipped View (tail)
Skipped: dependency coastline-build-fdlibm-for-ppc32 failed (or also skipped).
libpng Skipped View (tail)
Skipped: dependency coastline-build-zlib-for-ppc32 failed (or also skipped).
python2 Skipped View (tail)
Skipped: dependency coastline-build-fdlibm-for-ppc32 failed (or also skipped).
libmpc Skipped View (tail)
Skipped: dependency coastline-build-libmpfr-for-ppc32 failed (or also skipped).
gcc Skipped View (tail)
Skipped: dependency coastline-build-zlib-for-ppc32 failed (or also skipped).
HelenOS with libmpc Skipped View (tail)
Skipped: dependency helenos-build-ppc32 failed (or also skipped).
HelenOS with python2 Skipped View (tail)
Skipped: dependency helenos-build-ppc32 failed (or also skipped).
HelenOS with zlib Skipped View (tail)
Skipped: dependency helenos-build-ppc32 failed (or also skipped).
HelenOS with libisl Skipped View (tail)
Skipped: dependency helenos-build-ppc32 failed (or also skipped).
HelenOS with libmpfr Skipped View (tail)
Skipped: dependency helenos-build-ppc32 failed (or also skipped).
HelenOS with gcc Skipped View (tail)
Skipped: dependency helenos-build-ppc32 failed (or also skipped).
HelenOS with binutils,pcc Skipped View (tail)
Skipped: dependency helenos-build-ppc32 failed (or also skipped).
HelenOS with pcc Skipped View (tail)
Skipped: dependency helenos-build-ppc32 failed (or also skipped).
HelenOS with libgmp Skipped View (tail)
Skipped: dependency helenos-build-ppc32 failed (or also skipped).
HelenOS with libiconv Skipped View (tail)
Skipped: dependency helenos-build-ppc32 failed (or also skipped).
HelenOS with libpng Skipped View (tail)
Skipped: dependency helenos-build-ppc32 failed (or also skipped).
coast/libmpc/smoke.test Skipped View (tail)
Skipped: dependency extra-ppc32-with-libmpc failed (or also skipped).
coast/python2/hello.test Skipped View (tail)
Skipped: dependency extra-ppc32-with-python2 failed (or also skipped).
coast/python2/version.test Skipped View (tail)
Skipped: dependency extra-ppc32-with-python2 failed (or also skipped).
coast/zlib/minigzip.test Skipped View (tail)
Skipped: dependency extra-ppc32-with-zlib failed (or also skipped).
coast/libisl/smoke.test Skipped View (tail)
Skipped: dependency extra-ppc32-with-libisl failed (or also skipped).
coast/libmpfr/smoke.test Skipped View (tail)
Skipped: dependency extra-ppc32-with-libmpfr failed (or also skipped).
coast/gcc/version.test Skipped View (tail)
Skipped: dependency extra-ppc32-with-gcc failed (or also skipped).
coast/pcc/hello.test Skipped View (tail)
Skipped: dependency extra-ppc32-with-binutils-pcc failed (or also skipped).
coast/pcc/version.test Skipped View (tail)
Skipped: dependency extra-ppc32-with-pcc failed (or also skipped).
coast/libgmp/smoke.test Skipped View (tail)
Skipped: dependency extra-ppc32-with-libgmp failed (or also skipped).
coast/libiconv/version.test Skipped View (tail)
Skipped: dependency extra-ppc32-with-libiconv failed (or also skipped).
coast/libpng/pngtest.test Skipped View (tail)
Skipped: dependency extra-ppc32-with-libpng failed (or also skipped).
base/fs.test Skipped View (tail)
Skipped: dependency helenos-build-ppc32 failed (or also skipped).
base/tester_malloc1.test Skipped View (tail)
Skipped: dependency helenos-build-ppc32 failed (or also skipped).
boot.test Skipped View (tail)
Skipped: dependency helenos-build-ppc32 failed (or also skipped).

riscv64(back to top)

Task Result Download Log Duration
HelenOS Failed View (tail) 68 s
At top level:
exfat_ops.c:1240:13: error: 'exfat_fsinfo' defined but not used [-Werror=unused-function]
 static void exfat_fsinfo(exfat_bs_t *bs, service_id_t service_id)
             ^~~~~~~~~~~~
cc1: all warnings being treated as errors
make[2]: *** [../../../Makefile.common:339: exfat_ops.o] Error 1
make[2]: Leaving directory '/var/lib/helenos-ci/nightly/tmp-ci/build/riscv64/helenos/uspace/srv/fs/exfat'
make[1]: *** [Makefile:279: srv/fs/exfat.build] Error 2
make[1]: Leaving directory '/var/lib/helenos-ci/nightly/tmp-ci/build/riscv64/helenos/uspace'
make: *** [Makefile:61: uspace] Error 2
binutils Skipped View (tail)
Skipped: dependency coastline-prepare-for-riscv64 failed (or also skipped).
fdlibm Skipped View (tail)
Skipped: dependency coastline-prepare-for-riscv64 failed (or also skipped).
libgmp Skipped View (tail)
Skipped: dependency coastline-prepare-for-riscv64 failed (or also skipped).
libiconv Skipped View (tail)
Skipped: dependency coastline-prepare-for-riscv64 failed (or also skipped).
msim Skipped View (tail)
Skipped: dependency coastline-prepare-for-riscv64 failed (or also skipped).
pcc Skipped View (tail)
Skipped: dependency coastline-prepare-for-riscv64 failed (or also skipped).
zlib Skipped View (tail)
Skipped: dependency coastline-prepare-for-riscv64 failed (or also skipped).
jainja Skipped View (tail)
Skipped: dependency coastline-build-fdlibm-for-riscv64 failed (or also skipped).
libisl Skipped View (tail)
Skipped: dependency coastline-build-libgmp-for-riscv64 failed (or also skipped).
libmpfr Skipped View (tail)
Skipped: dependency coastline-build-fdlibm-for-riscv64 failed (or also skipped).
libpng Skipped View (tail)
Skipped: dependency coastline-build-zlib-for-riscv64 failed (or also skipped).
python2 Skipped View (tail)
Skipped: dependency coastline-build-fdlibm-for-riscv64 failed (or also skipped).
libmpc Skipped View (tail)
Skipped: dependency coastline-build-libmpfr-for-riscv64 failed (or also skipped).
gcc Skipped View (tail)
Skipped: dependency coastline-build-zlib-for-riscv64 failed (or also skipped).

sparc64/niagara(back to top)

Task Result Download Log Duration
HelenOS Failed View (tail) 68 s
At top level:
exfat_ops.c:1240:13: error: 'exfat_fsinfo' defined but not used [-Werror=unused-function]
 static void exfat_fsinfo(exfat_bs_t *bs, service_id_t service_id)
             ^~~~~~~~~~~~
cc1: all warnings being treated as errors
make[2]: *** [../../../Makefile.common:339: exfat_ops.o] Error 1
make[2]: Leaving directory '/var/lib/helenos-ci/nightly/tmp-ci/build/sparc64-niagara/helenos/uspace/srv/fs/exfat'
make[1]: *** [Makefile:279: srv/fs/exfat.build] Error 2
make[1]: Leaving directory '/var/lib/helenos-ci/nightly/tmp-ci/build/sparc64-niagara/helenos/uspace'
make: *** [Makefile:61: uspace] Error 2
binutils Skipped View (tail)
Skipped: dependency coastline-prepare-for-sparc64-niagara failed (or also skipped).
fdlibm Skipped View (tail)
Skipped: dependency coastline-prepare-for-sparc64-niagara failed (or also skipped).
libgmp Skipped View (tail)
Skipped: dependency coastline-prepare-for-sparc64-niagara failed (or also skipped).
libiconv Skipped View (tail)
Skipped: dependency coastline-prepare-for-sparc64-niagara failed (or also skipped).
msim Skipped View (tail)
Skipped: dependency coastline-prepare-for-sparc64-niagara failed (or also skipped).
pcc Skipped View (tail)
Skipped: dependency coastline-prepare-for-sparc64-niagara failed (or also skipped).
zlib Skipped View (tail)
Skipped: dependency coastline-prepare-for-sparc64-niagara failed (or also skipped).
jainja Skipped View (tail)
Skipped: dependency coastline-build-fdlibm-for-sparc64-niagara failed (or also skipped).
libisl Skipped View (tail)
Skipped: dependency coastline-build-libgmp-for-sparc64-niagara failed (or also skipped).
libmpfr Skipped View (tail)
Skipped: dependency coastline-build-fdlibm-for-sparc64-niagara failed (or also skipped).
libpng Skipped View (tail)
Skipped: dependency coastline-build-zlib-for-sparc64-niagara failed (or also skipped).
python2 Skipped View (tail)
Skipped: dependency coastline-build-fdlibm-for-sparc64-niagara failed (or also skipped).
libmpc Skipped View (tail)
Skipped: dependency coastline-build-libmpfr-for-sparc64-niagara failed (or also skipped).
gcc Skipped View (tail)
Skipped: dependency coastline-build-zlib-for-sparc64-niagara failed (or also skipped).

sparc64/ultra(back to top)

Task Result Download Log Duration
HelenOS Failed View (tail) 68 s
At top level:
exfat_ops.c:1240:13: error: 'exfat_fsinfo' defined but not used [-Werror=unused-function]
 static void exfat_fsinfo(exfat_bs_t *bs, service_id_t service_id)
             ^~~~~~~~~~~~
cc1: all warnings being treated as errors
make[2]: *** [../../../Makefile.common:339: exfat_ops.o] Error 1
make[2]: Leaving directory '/var/lib/helenos-ci/nightly/tmp-ci/build/sparc64-ultra/helenos/uspace/srv/fs/exfat'
make[1]: *** [Makefile:279: srv/fs/exfat.build] Error 2
make[1]: Leaving directory '/var/lib/helenos-ci/nightly/tmp-ci/build/sparc64-ultra/helenos/uspace'
make: *** [Makefile:61: uspace] Error 2
binutils Skipped View (tail)
Skipped: dependency coastline-prepare-for-sparc64-ultra failed (or also skipped).
fdlibm Skipped View (tail)
Skipped: dependency coastline-prepare-for-sparc64-ultra failed (or also skipped).
libgmp Skipped View (tail)
Skipped: dependency coastline-prepare-for-sparc64-ultra failed (or also skipped).
libiconv Skipped View (tail)
Skipped: dependency coastline-prepare-for-sparc64-ultra failed (or also skipped).
msim Skipped View (tail)
Skipped: dependency coastline-prepare-for-sparc64-ultra failed (or also skipped).
pcc Skipped View (tail)
Skipped: dependency coastline-prepare-for-sparc64-ultra failed (or also skipped).
zlib Skipped View (tail)
Skipped: dependency coastline-prepare-for-sparc64-ultra failed (or also skipped).
jainja Skipped View (tail)
Skipped: dependency coastline-build-fdlibm-for-sparc64-ultra failed (or also skipped).
libisl Skipped View (tail)
Skipped: dependency coastline-build-libgmp-for-sparc64-ultra failed (or also skipped).
libmpfr Skipped View (tail)
Skipped: dependency coastline-build-fdlibm-for-sparc64-ultra failed (or also skipped).
libpng Skipped View (tail)
Skipped: dependency coastline-build-zlib-for-sparc64-ultra failed (or also skipped).
python2 Skipped View (tail)
Skipped: dependency coastline-build-fdlibm-for-sparc64-ultra failed (or also skipped).
libmpc Skipped View (tail)
Skipped: dependency coastline-build-libmpfr-for-sparc64-ultra failed (or also skipped).
gcc Skipped View (tail)
Skipped: dependency coastline-build-zlib-for-sparc64-ultra failed (or also skipped).

special/abs32le(back to top)

Task Result Download Log Duration
HelenOS Failed View (tail) 69 s
At top level:
exfat_ops.c:1240:13: error: 'exfat_fsinfo' defined but not used [-Werror=unused-function]
 static void exfat_fsinfo(exfat_bs_t *bs, service_id_t service_id)
             ^~~~~~~~~~~~
cc1: all warnings being treated as errors
make[2]: *** [../../../Makefile.common:339: exfat_ops.o] Error 1
make[2]: Leaving directory '/var/lib/helenos-ci/nightly/tmp-ci/build/special-abs32le/helenos/uspace/srv/fs/exfat'
make[1]: *** [Makefile:279: srv/fs/exfat.build] Error 2
make[1]: Leaving directory '/var/lib/helenos-ci/nightly/tmp-ci/build/special-abs32le/helenos/uspace'
make: *** [Makefile:61: uspace] Error 2

Per-harbour details(back to top)

binutils(back to top)

Architecture Result Download Log Duration
Tarball fetch OK View (tail) 8 s
 18250K .......... .......... .......... .......... .......... 98% 15.4M 0s
 18300K .......... .......... .......... .......... .......... 98% 32.4M 0s
 18350K .......... .......... .......... .......... .......... 99% 58.6M 0s
 18400K .......... .......... .......... .......... .......... 99% 45.4M 0s
 18450K .......... .......... .......... .......... .......... 99% 33.0M 0s
 18500K .......... .......... .......... .......... .......... 99%  468K 0s
 18550K ..                                                    100% 4759G=5.7s

2018-05-11 01:17:19 (3.16 MB/s) - ‘/var/lib/helenos-ci/nightly/tmp-ci/mirror/sources/binutils-2.21.1.tar.bz2’ saved [18997755]

amd64 Skipped View (tail)
Skipped: dependency coastline-prepare-for-amd64 failed (or also skipped).
arm32/beagleboardxm Skipped View (tail)
Skipped: dependency coastline-prepare-for-arm32-beagleboardxm failed (or also skipped).
arm32/beaglebone Skipped View (tail)
Skipped: dependency coastline-prepare-for-arm32-beaglebone failed (or also skipped).
arm32/gta02 Skipped View (tail)
Skipped: dependency coastline-prepare-for-arm32-gta02 failed (or also skipped).
arm32/integratorcp Skipped View (tail)
Skipped: dependency coastline-prepare-for-arm32-integratorcp failed (or also skipped).
arm32/raspberrypi Skipped View (tail)
Skipped: dependency coastline-prepare-for-arm32-raspberrypi failed (or also skipped).
ia32 Skipped View (tail)
Skipped: dependency coastline-prepare-for-ia32 failed (or also skipped).
ia64/i460GX Skipped View (tail)
Skipped: dependency coastline-prepare-for-ia64-i460GX failed (or also skipped).
ia64/ski Skipped View (tail)
Skipped: dependency coastline-prepare-for-ia64-ski failed (or also skipped).
mips32/malta-be Skipped View (tail)
Skipped: dependency coastline-prepare-for-mips32-malta-be failed (or also skipped).
mips32/malta-le Skipped View (tail)
Skipped: dependency coastline-prepare-for-mips32-malta-le failed (or also skipped).
mips32/msim Skipped View (tail)
Skipped: dependency coastline-prepare-for-mips32-msim failed (or also skipped).
ppc32 Skipped View (tail)
Skipped: dependency coastline-prepare-for-ppc32 failed (or also skipped).
riscv64 Skipped View (tail)
Skipped: dependency coastline-prepare-for-riscv64 failed (or also skipped).
sparc64/niagara Skipped View (tail)
Skipped: dependency coastline-prepare-for-sparc64-niagara failed (or also skipped).
sparc64/ultra Skipped View (tail)
Skipped: dependency coastline-prepare-for-sparc64-ultra failed (or also skipped).

fdlibm(back to top)

Architecture Result Download Log Duration
Tarball fetch OK View (tail) 2 s
Connecting to www.validlab.com|209.128.78.139|:80... connected.
HTTP request sent, awaiting response... 200 OK
Length: 99573 (97K) [application/x-gzip]
Saving to: ‘/var/lib/helenos-ci/nightly/tmp-ci/mirror/sources/fdlibm53.tar.gz’

     0K .......... .......... .......... .......... .......... 51% 73.1K 1s
    50K .......... .......... .......... .......... .......   100% 2.29M=0.7s

2018-05-11 01:17:21 (138 KB/s) - ‘/var/lib/helenos-ci/nightly/tmp-ci/mirror/sources/fdlibm53.tar.gz’ saved [99573/99573]

amd64 Skipped View (tail)
Skipped: dependency coastline-prepare-for-amd64 failed (or also skipped).
arm32/beagleboardxm Skipped View (tail)
Skipped: dependency coastline-prepare-for-arm32-beagleboardxm failed (or also skipped).
arm32/beaglebone Skipped View (tail)
Skipped: dependency coastline-prepare-for-arm32-beaglebone failed (or also skipped).
arm32/gta02 Skipped View (tail)
Skipped: dependency coastline-prepare-for-arm32-gta02 failed (or also skipped).
arm32/integratorcp Skipped View (tail)
Skipped: dependency coastline-prepare-for-arm32-integratorcp failed (or also skipped).
arm32/raspberrypi Skipped View (tail)
Skipped: dependency coastline-prepare-for-arm32-raspberrypi failed (or also skipped).
ia32 Skipped View (tail)
Skipped: dependency coastline-prepare-for-ia32 failed (or also skipped).
ia64/i460GX Skipped View (tail)
Skipped: dependency coastline-prepare-for-ia64-i460GX failed (or also skipped).
ia64/ski Skipped View (tail)
Skipped: dependency coastline-prepare-for-ia64-ski failed (or also skipped).
mips32/malta-be Skipped View (tail)
Skipped: dependency coastline-prepare-for-mips32-malta-be failed (or also skipped).
mips32/malta-le Skipped View (tail)
Skipped: dependency coastline-prepare-for-mips32-malta-le failed (or also skipped).
mips32/msim Skipped View (tail)
Skipped: dependency coastline-prepare-for-mips32-msim failed (or also skipped).
ppc32 Skipped View (tail)
Skipped: dependency coastline-prepare-for-ppc32 failed (or also skipped).
riscv64 Skipped View (tail)
Skipped: dependency coastline-prepare-for-riscv64 failed (or also skipped).
sparc64/niagara Skipped View (tail)
Skipped: dependency coastline-prepare-for-sparc64-niagara failed (or also skipped).
sparc64/ultra Skipped View (tail)
Skipped: dependency coastline-prepare-for-sparc64-ultra failed (or also skipped).

gcc(back to top)

Architecture Result Download Log Duration
Tarball fetch OK View (tail) 4 s
 70000K .......... .......... .......... .......... .......... 99% 3.75M 0s
 70050K .......... .......... .......... .......... .......... 99% 57.6M 0s
 70100K .......... .......... .......... .......... .......... 99% 95.4M 0s
 70150K .......... .......... .......... .......... .......... 99%  103M 0s
 70200K .......... .......... .......... .......... .......... 99%  148M 0s
 70250K .......... .......... .......... .......... .......... 99%  115M 0s
 70300K .......... .                                          100% 56.4M=3.1s

2018-05-11 01:17:46 (22.2 MB/s) - ‘/var/lib/helenos-ci/nightly/tmp-ci/mirror/sources/gcc-4.6.3.tar.bz2’ saved [71999439]

amd64 Skipped View (tail)
Skipped: dependency coastline-build-zlib-for-amd64 failed (or also skipped).
arm32/beagleboardxm Skipped View (tail)
Skipped: dependency coastline-build-zlib-for-arm32-beagleboardxm failed (or also skipped).
arm32/beaglebone Skipped View (tail)
Skipped: dependency coastline-build-zlib-for-arm32-beaglebone failed (or also skipped).
arm32/gta02 Skipped View (tail)
Skipped: dependency coastline-build-zlib-for-arm32-gta02 failed (or also skipped).
arm32/integratorcp Skipped View (tail)
Skipped: dependency coastline-build-zlib-for-arm32-integratorcp failed (or also skipped).
arm32/raspberrypi Skipped View (tail)
Skipped: dependency coastline-build-zlib-for-arm32-raspberrypi failed (or also skipped).
ia32 Skipped View (tail)
Skipped: dependency coastline-build-zlib-for-ia32 failed (or also skipped).
ia64/i460GX Skipped View (tail)
Skipped: dependency coastline-build-zlib-for-ia64-i460GX failed (or also skipped).
ia64/ski Skipped View (tail)
Skipped: dependency coastline-build-zlib-for-ia64-ski failed (or also skipped).
mips32/malta-be Skipped View (tail)
Skipped: dependency coastline-build-zlib-for-mips32-malta-be failed (or also skipped).
mips32/malta-le Skipped View (tail)
Skipped: dependency coastline-build-zlib-for-mips32-malta-le failed (or also skipped).
mips32/msim Skipped View (tail)
Skipped: dependency coastline-build-zlib-for-mips32-msim failed (or also skipped).
ppc32 Skipped View (tail)
Skipped: dependency coastline-build-zlib-for-ppc32 failed (or also skipped).
riscv64 Skipped View (tail)
Skipped: dependency coastline-build-zlib-for-riscv64 failed (or also skipped).
sparc64/niagara Skipped View (tail)
Skipped: dependency coastline-build-zlib-for-sparc64-niagara failed (or also skipped).
sparc64/ultra Skipped View (tail)
Skipped: dependency coastline-build-zlib-for-sparc64-ultra failed (or also skipped).

jainja(back to top)

Architecture Result Download Log Duration
Tarball fetch OK View (tail) 3 s
  5950K .......... .......... .......... .......... .......... 95% 61.9M 0s
  6000K .......... .......... .......... .......... .......... 96% 95.9M 0s
  6050K .......... .......... .......... .......... .......... 97% 58.2M 0s
  6100K .......... .......... .......... .......... .......... 98% 99.8M 0s
  6150K .......... .......... .......... .......... .......... 99% 90.6M 0s
  6200K .......... .......... .......... .......... .......... 99% 98.0M 0s
  6250K .                                                     100% 3459G=0.2s

2018-05-11 01:17:38 (24.5 MB/s) - ‘/var/lib/helenos-ci/nightly/tmp-ci/mirror/sources/jainja-0.8.tar.gz’ saved [6401857/6401857]

amd64 Skipped View (tail)
Skipped: dependency coastline-build-fdlibm-for-amd64 failed (or also skipped).
arm32/beagleboardxm Skipped View (tail)
Skipped: dependency coastline-build-fdlibm-for-arm32-beagleboardxm failed (or also skipped).
arm32/beaglebone Skipped View (tail)
Skipped: dependency coastline-build-fdlibm-for-arm32-beaglebone failed (or also skipped).
arm32/gta02 Skipped View (tail)
Skipped: dependency coastline-build-fdlibm-for-arm32-gta02 failed (or also skipped).
arm32/integratorcp Skipped View (tail)
Skipped: dependency coastline-build-fdlibm-for-arm32-integratorcp failed (or also skipped).
arm32/raspberrypi Skipped View (tail)
Skipped: dependency coastline-build-fdlibm-for-arm32-raspberrypi failed (or also skipped).
ia32 Skipped View (tail)
Skipped: dependency coastline-build-fdlibm-for-ia32 failed (or also skipped).
ia64/i460GX Skipped View (tail)
Skipped: dependency coastline-build-fdlibm-for-ia64-i460GX failed (or also skipped).
ia64/ski Skipped View (tail)
Skipped: dependency coastline-build-fdlibm-for-ia64-ski failed (or also skipped).
mips32/malta-be Skipped View (tail)
Skipped: dependency coastline-build-fdlibm-for-mips32-malta-be failed (or also skipped).
mips32/malta-le Skipped View (tail)
Skipped: dependency coastline-build-fdlibm-for-mips32-malta-le failed (or also skipped).
mips32/msim Skipped View (tail)
Skipped: dependency coastline-build-fdlibm-for-mips32-msim failed (or also skipped).
ppc32 Skipped View (tail)
Skipped: dependency coastline-build-fdlibm-for-ppc32 failed (or also skipped).
riscv64 Skipped View (tail)
Skipped: dependency coastline-build-fdlibm-for-riscv64 failed (or also skipped).
sparc64/niagara Skipped View (tail)
Skipped: dependency coastline-build-fdlibm-for-sparc64-niagara failed (or also skipped).
sparc64/ultra Skipped View (tail)
Skipped: dependency coastline-build-fdlibm-for-sparc64-ultra failed (or also skipped).

libgmp(back to top)

Architecture Result Download Log Duration
Tarball fetch Failed View (tail)
--2018-05-11 01:58:32--  (try:19)  https://gmplib.org/download/gmp/gmp-5.1.0.tar.bz2
Connecting to gmplib.org|130.242.124.102|:443... failed: Connection timed out.
Retrying.

--2018-05-11 02:00:52--  (try:20)  https://gmplib.org/download/gmp/gmp-5.1.0.tar.bz2
Connecting to gmplib.org|130.242.124.102|:443... failed: Connection timed out.
Giving up.

[hsct]: Error: Failed to fetch https://gmplib.org/download/gmp/gmp-5.1.0.tar.bz2.
amd64 Skipped View (tail)
Skipped: dependency coastline-prepare-for-amd64 failed (or also skipped).
arm32/beagleboardxm Skipped View (tail)
Skipped: dependency coastline-prepare-for-arm32-beagleboardxm failed (or also skipped).
arm32/beaglebone Skipped View (tail)
Skipped: dependency coastline-prepare-for-arm32-beaglebone failed (or also skipped).
arm32/gta02 Skipped View (tail)
Skipped: dependency coastline-prepare-for-arm32-gta02 failed (or also skipped).
arm32/integratorcp Skipped View (tail)
Skipped: dependency coastline-prepare-for-arm32-integratorcp failed (or also skipped).
arm32/raspberrypi Skipped View (tail)
Skipped: dependency coastline-prepare-for-arm32-raspberrypi failed (or also skipped).
ia32 Skipped View (tail)
Skipped: dependency coastline-prepare-for-ia32 failed (or also skipped).
ia64/i460GX Skipped View (tail)
Skipped: dependency coastline-prepare-for-ia64-i460GX failed (or also skipped).
ia64/ski Skipped View (tail)
Skipped: dependency coastline-prepare-for-ia64-ski failed (or also skipped).
mips32/malta-be Skipped View (tail)
Skipped: dependency coastline-prepare-for-mips32-malta-be failed (or also skipped).
mips32/malta-le Skipped View (tail)
Skipped: dependency coastline-prepare-for-mips32-malta-le failed (or also skipped).
mips32/msim Skipped View (tail)
Skipped: dependency coastline-prepare-for-mips32-msim failed (or also skipped).
ppc32 Skipped View (tail)
Skipped: dependency coastline-prepare-for-ppc32 failed (or also skipped).
riscv64 Skipped View (tail)
Skipped: dependency coastline-prepare-for-riscv64 failed (or also skipped).
sparc64/niagara Skipped View (tail)
Skipped: dependency coastline-prepare-for-sparc64-niagara failed (or also skipped).
sparc64/ultra Skipped View (tail)
Skipped: dependency coastline-prepare-for-sparc64-ultra failed (or also skipped).

libiconv(back to top)

Architecture Result Download Log Duration
Tarball fetch OK View (tail) 2 s
  4550K .......... .......... .......... .......... .......... 94%  106M 0s
  4600K .......... .......... .......... .......... .......... 95% 53.9M 0s
  4650K .......... .......... .......... .......... .......... 96%  106M 0s
  4700K .......... .......... .......... .......... .......... 97%  103M 0s
  4750K .......... .......... .......... .......... .......... 98% 63.0M 0s
  4800K .......... .......... .......... .......... .......... 99% 46.5M 0s
  4850K .......... .......                                    100% 33.2M=1.2s

2018-05-11 01:17:28 (3.81 MB/s) - ‘/var/lib/helenos-ci/nightly/tmp-ci/mirror/sources/libiconv-1.14.tar.gz’ saved [4984397/4984397]

amd64 Skipped View (tail)
Skipped: dependency coastline-prepare-for-amd64 failed (or also skipped).
arm32/beagleboardxm Skipped View (tail)
Skipped: dependency coastline-prepare-for-arm32-beagleboardxm failed (or also skipped).
arm32/beaglebone Skipped View (tail)
Skipped: dependency coastline-prepare-for-arm32-beaglebone failed (or also skipped).
arm32/gta02 Skipped View (tail)
Skipped: dependency coastline-prepare-for-arm32-gta02 failed (or also skipped).
arm32/integratorcp Skipped View (tail)
Skipped: dependency coastline-prepare-for-arm32-integratorcp failed (or also skipped).
arm32/raspberrypi Skipped View (tail)
Skipped: dependency coastline-prepare-for-arm32-raspberrypi failed (or also skipped).
ia32 Skipped View (tail)
Skipped: dependency coastline-prepare-for-ia32 failed (or also skipped).
ia64/i460GX Skipped View (tail)
Skipped: dependency coastline-prepare-for-ia64-i460GX failed (or also skipped).
ia64/ski Skipped View (tail)
Skipped: dependency coastline-prepare-for-ia64-ski failed (or also skipped).
mips32/malta-be Skipped View (tail)
Skipped: dependency coastline-prepare-for-mips32-malta-be failed (or also skipped).
mips32/malta-le Skipped View (tail)
Skipped: dependency coastline-prepare-for-mips32-malta-le failed (or also skipped).
mips32/msim Skipped View (tail)
Skipped: dependency coastline-prepare-for-mips32-msim failed (or also skipped).
ppc32 Skipped View (tail)
Skipped: dependency coastline-prepare-for-ppc32 failed (or also skipped).
riscv64 Skipped View (tail)
Skipped: dependency coastline-prepare-for-riscv64 failed (or also skipped).
sparc64/niagara Skipped View (tail)
Skipped: dependency coastline-prepare-for-sparc64-niagara failed (or also skipped).
sparc64/ultra Skipped View (tail)
Skipped: dependency coastline-prepare-for-sparc64-ultra failed (or also skipped).

libisl(back to top)

Architecture Result Download Log Duration
Tarball fetch OK View (tail) 0 s
   900K .......... .......... .......... .......... .......... 78%  198M 0s
   950K .......... .......... .......... .......... .......... 82%  190M 0s
  1000K .......... .......... .......... .......... .......... 86%  259M 0s
  1050K .......... .......... .......... .......... .......... 90%  211M 0s
  1100K .......... .......... .......... .......... .......... 94%  205M 0s
  1150K .......... .......... .......... .......... .......... 98%  173M 0s
  1200K .......... .....                                      100%  164M=0.2s

2018-05-11 01:17:38 (6.79 MB/s) - ‘/var/lib/helenos-ci/nightly/tmp-ci/mirror/sources/isl-0.11.1.tar.bz2’ saved [1244610/1244610]

amd64 Skipped View (tail)
Skipped: dependency coastline-build-libgmp-for-amd64 failed (or also skipped).
arm32/beagleboardxm Skipped View (tail)
Skipped: dependency coastline-build-libgmp-for-arm32-beagleboardxm failed (or also skipped).
arm32/beaglebone Skipped View (tail)
Skipped: dependency coastline-build-libgmp-for-arm32-beaglebone failed (or also skipped).
arm32/gta02 Skipped View (tail)
Skipped: dependency coastline-build-libgmp-for-arm32-gta02 failed (or also skipped).
arm32/integratorcp Skipped View (tail)
Skipped: dependency coastline-build-libgmp-for-arm32-integratorcp failed (or also skipped).
arm32/raspberrypi Skipped View (tail)
Skipped: dependency coastline-build-libgmp-for-arm32-raspberrypi failed (or also skipped).
ia32 Skipped View (tail)
Skipped: dependency coastline-build-libgmp-for-ia32 failed (or also skipped).
ia64/i460GX Skipped View (tail)
Skipped: dependency coastline-build-libgmp-for-ia64-i460GX failed (or also skipped).
ia64/ski Skipped View (tail)
Skipped: dependency coastline-build-libgmp-for-ia64-ski failed (or also skipped).
mips32/malta-be Skipped View (tail)
Skipped: dependency coastline-build-libgmp-for-mips32-malta-be failed (or also skipped).
mips32/malta-le Skipped View (tail)
Skipped: dependency coastline-build-libgmp-for-mips32-malta-le failed (or also skipped).
mips32/msim Skipped View (tail)
Skipped: dependency coastline-build-libgmp-for-mips32-msim failed (or also skipped).
ppc32 Skipped View (tail)
Skipped: dependency coastline-build-libgmp-for-ppc32 failed (or also skipped).
riscv64 Skipped View (tail)
Skipped: dependency coastline-build-libgmp-for-riscv64 failed (or also skipped).
sparc64/niagara Skipped View (tail)
Skipped: dependency coastline-build-libgmp-for-sparc64-niagara failed (or also skipped).
sparc64/ultra Skipped View (tail)
Skipped: dependency coastline-build-libgmp-for-sparc64-ultra failed (or also skipped).

libmpc(back to top)

Architecture Result Download Log Duration
Tarball fetch OK View (tail) 2 s
   300K .......... .......... .......... .......... .......... 57%  101M 0s
   350K .......... .......... .......... .......... .......... 65%  500K 0s
   400K .......... .......... .......... .......... .......... 73% 60.4M 0s
   450K .......... .......... .......... .......... .......... 82%  107M 0s
   500K .......... .......... .......... .......... .......... 90% 89.9M 0s
   550K .......... .......... .......... .......... .......... 98% 64.1M 0s
   600K .........                                             100%  168M=0.5s

2018-05-11 01:17:42 (1.13 MB/s) - ‘/var/lib/helenos-ci/nightly/tmp-ci/mirror/sources/mpc-1.0.1.tar.gz’ saved [624125]

amd64 Skipped View (tail)
Skipped: dependency coastline-build-libmpfr-for-amd64 failed (or also skipped).
arm32/beagleboardxm Skipped View (tail)
Skipped: dependency coastline-build-libmpfr-for-arm32-beagleboardxm failed (or also skipped).
arm32/beaglebone Skipped View (tail)
Skipped: dependency coastline-build-libmpfr-for-arm32-beaglebone failed (or also skipped).
arm32/gta02 Skipped View (tail)
Skipped: dependency coastline-build-libmpfr-for-arm32-gta02 failed (or also skipped).
arm32/integratorcp Skipped View (tail)
Skipped: dependency coastline-build-libmpfr-for-arm32-integratorcp failed (or also skipped).
arm32/raspberrypi Skipped View (tail)
Skipped: dependency coastline-build-libmpfr-for-arm32-raspberrypi failed (or also skipped).
ia32 Skipped View (tail)
Skipped: dependency coastline-build-libmpfr-for-ia32 failed (or also skipped).
ia64/i460GX Skipped View (tail)
Skipped: dependency coastline-build-libmpfr-for-ia64-i460GX failed (or also skipped).
ia64/ski Skipped View (tail)
Skipped: dependency coastline-build-libmpfr-for-ia64-ski failed (or also skipped).
mips32/malta-be Skipped View (tail)
Skipped: dependency coastline-build-libmpfr-for-mips32-malta-be failed (or also skipped).
mips32/malta-le Skipped View (tail)
Skipped: dependency coastline-build-libmpfr-for-mips32-malta-le failed (or also skipped).
mips32/msim Skipped View (tail)
Skipped: dependency coastline-build-libmpfr-for-mips32-msim failed (or also skipped).
ppc32 Skipped View (tail)
Skipped: dependency coastline-build-libmpfr-for-ppc32 failed (or also skipped).
riscv64 Skipped View (tail)
Skipped: dependency coastline-build-libmpfr-for-riscv64 failed (or also skipped).
sparc64/niagara Skipped View (tail)
Skipped: dependency coastline-build-libmpfr-for-sparc64-niagara failed (or also skipped).
sparc64/ultra Skipped View (tail)
Skipped: dependency coastline-build-libmpfr-for-sparc64-ultra failed (or also skipped).

libmpfr(back to top)

Architecture Result Download Log Duration
Tarball fetch OK View (tail) 0 s
   850K .......... .......... .......... .......... .......... 75% 97.4M 0s
   900K .......... .......... .......... .......... .......... 79%  109M 0s
   950K .......... .......... .......... .......... .......... 84%  108M 0s
  1000K .......... .......... .......... .......... .......... 88%  109M 0s
  1050K .......... .......... .......... .......... .......... 92%  110M 0s
  1100K .......... .......... .......... .......... .......... 96%  122M 0s
  1150K .......... .......... .......... ..........           100% 99.0M=0.2s

2018-05-11 01:17:39 (6.56 MB/s) - ‘/var/lib/helenos-ci/nightly/tmp-ci/mirror/sources/mpfr-3.1.1.tar.bz2’ saved [1218825/1218825]

amd64 Skipped View (tail)
Skipped: dependency coastline-build-fdlibm-for-amd64 failed (or also skipped).
arm32/beagleboardxm Skipped View (tail)
Skipped: dependency coastline-build-fdlibm-for-arm32-beagleboardxm failed (or also skipped).
arm32/beaglebone Skipped View (tail)
Skipped: dependency coastline-build-fdlibm-for-arm32-beaglebone failed (or also skipped).
arm32/gta02 Skipped View (tail)
Skipped: dependency coastline-build-fdlibm-for-arm32-gta02 failed (or also skipped).
arm32/integratorcp Skipped View (tail)
Skipped: dependency coastline-build-fdlibm-for-arm32-integratorcp failed (or also skipped).
arm32/raspberrypi Skipped View (tail)
Skipped: dependency coastline-build-fdlibm-for-arm32-raspberrypi failed (or also skipped).
ia32 Skipped View (tail)
Skipped: dependency coastline-build-fdlibm-for-ia32 failed (or also skipped).
ia64/i460GX Skipped View (tail)
Skipped: dependency coastline-build-fdlibm-for-ia64-i460GX failed (or also skipped).
ia64/ski Skipped View (tail)
Skipped: dependency coastline-build-fdlibm-for-ia64-ski failed (or also skipped).
mips32/malta-be Skipped View (tail)
Skipped: dependency coastline-build-fdlibm-for-mips32-malta-be failed (or also skipped).
mips32/malta-le Skipped View (tail)
Skipped: dependency coastline-build-fdlibm-for-mips32-malta-le failed (or also skipped).
mips32/msim Skipped View (tail)
Skipped: dependency coastline-build-fdlibm-for-mips32-msim failed (or also skipped).
ppc32 Skipped View (tail)
Skipped: dependency coastline-build-fdlibm-for-ppc32 failed (or also skipped).
riscv64 Skipped View (tail)
Skipped: dependency coastline-build-fdlibm-for-riscv64 failed (or also skipped).
sparc64/niagara Skipped View (tail)
Skipped: dependency coastline-build-fdlibm-for-sparc64-niagara failed (or also skipped).
sparc64/ultra Skipped View (tail)
Skipped: dependency coastline-build-fdlibm-for-sparc64-ultra failed (or also skipped).

libpng(back to top)

Architecture Result Download Log Duration
Tarball fetch OK View (tail) 1 s
  1000K .......... .......... .......... .......... .......... 79%  105M 0s
  1050K .......... .......... .......... .......... .......... 83% 97.9M 0s
  1100K .......... .......... .......... .......... .......... 86% 99.0M 0s
  1150K .......... .......... .......... .......... .......... 90% 81.7M 0s
  1200K .......... .......... .......... .......... .......... 94%  102M 0s
  1250K .......... .......... .......... .......... .......... 98%  104M 0s
  1300K .......... .......... ..                              100%  124M=0.07s

2018-05-11 01:17:40 (17.5 MB/s) - ‘/var/lib/helenos-ci/nightly/tmp-ci/mirror/sources/libpng-1.6.12.tar.gz’ saved [1354223/1354223]

amd64 Skipped View (tail)
Skipped: dependency coastline-build-zlib-for-amd64 failed (or also skipped).
arm32/beagleboardxm Skipped View (tail)
Skipped: dependency coastline-build-zlib-for-arm32-beagleboardxm failed (or also skipped).
arm32/beaglebone Skipped View (tail)
Skipped: dependency coastline-build-zlib-for-arm32-beaglebone failed (or also skipped).
arm32/gta02 Skipped View (tail)
Skipped: dependency coastline-build-zlib-for-arm32-gta02 failed (or also skipped).
arm32/integratorcp Skipped View (tail)
Skipped: dependency coastline-build-zlib-for-arm32-integratorcp failed (or also skipped).
arm32/raspberrypi Skipped View (tail)
Skipped: dependency coastline-build-zlib-for-arm32-raspberrypi failed (or also skipped).
ia32 Skipped View (tail)
Skipped: dependency coastline-build-zlib-for-ia32 failed (or also skipped).
ia64/i460GX Skipped View (tail)
Skipped: dependency coastline-build-zlib-for-ia64-i460GX failed (or also skipped).
ia64/ski Skipped View (tail)
Skipped: dependency coastline-build-zlib-for-ia64-ski failed (or also skipped).
mips32/malta-be Skipped View (tail)
Skipped: dependency coastline-build-zlib-for-mips32-malta-be failed (or also skipped).
mips32/malta-le Skipped View (tail)
Skipped: dependency coastline-build-zlib-for-mips32-malta-le failed (or also skipped).
mips32/msim Skipped View (tail)
Skipped: dependency coastline-build-zlib-for-mips32-msim failed (or also skipped).
ppc32 Skipped View (tail)
Skipped: dependency coastline-build-zlib-for-ppc32 failed (or also skipped).
riscv64 Skipped View (tail)
Skipped: dependency coastline-build-zlib-for-riscv64 failed (or also skipped).
sparc64/niagara Skipped View (tail)
Skipped: dependency coastline-build-zlib-for-sparc64-niagara failed (or also skipped).
sparc64/ultra Skipped View (tail)
Skipped: dependency coastline-build-zlib-for-sparc64-ultra failed (or also skipped).

msim(back to top)

Architecture Result Download Log Duration
Tarball fetch OK View (tail) 0 s
Length: 167755 (164K) [application/x-bzip2]
Saving to: ‘/var/lib/helenos-ci/nightly/tmp-ci/mirror/sources/msim-1.3.8.1.tar.bz2’

     0K .......... .......... .......... .......... .......... 30%  367M 0s
    50K .......... .......... .......... .......... .......... 61%  471M 0s
   100K .......... .......... .......... .......... .......... 91% 86.1M 0s
   150K .......... ...                                        100%  111M=0.001s

2018-05-11 01:17:28 (173 MB/s) - ‘/var/lib/helenos-ci/nightly/tmp-ci/mirror/sources/msim-1.3.8.1.tar.bz2’ saved [167755/167755]

amd64 Skipped View (tail)
Skipped: dependency coastline-prepare-for-amd64 failed (or also skipped).
arm32/beagleboardxm Skipped View (tail)
Skipped: dependency coastline-prepare-for-arm32-beagleboardxm failed (or also skipped).
arm32/beaglebone Skipped View (tail)
Skipped: dependency coastline-prepare-for-arm32-beaglebone failed (or also skipped).
arm32/gta02 Skipped View (tail)
Skipped: dependency coastline-prepare-for-arm32-gta02 failed (or also skipped).
arm32/integratorcp Skipped View (tail)
Skipped: dependency coastline-prepare-for-arm32-integratorcp failed (or also skipped).
arm32/raspberrypi Skipped View (tail)
Skipped: dependency coastline-prepare-for-arm32-raspberrypi failed (or also skipped).
ia32 Skipped View (tail)
Skipped: dependency coastline-prepare-for-ia32 failed (or also skipped).
ia64/i460GX Skipped View (tail)
Skipped: dependency coastline-prepare-for-ia64-i460GX failed (or also skipped).
ia64/ski Skipped View (tail)
Skipped: dependency coastline-prepare-for-ia64-ski failed (or also skipped).
mips32/malta-be Skipped View (tail)
Skipped: dependency coastline-prepare-for-mips32-malta-be failed (or also skipped).
mips32/malta-le Skipped View (tail)
Skipped: dependency coastline-prepare-for-mips32-malta-le failed (or also skipped).
mips32/msim Skipped View (tail)
Skipped: dependency coastline-prepare-for-mips32-msim failed (or also skipped).
ppc32 Skipped View (tail)
Skipped: dependency coastline-prepare-for-ppc32 failed (or also skipped).
riscv64 Skipped View (tail)
Skipped: dependency coastline-prepare-for-riscv64 failed (or also skipped).
sparc64/niagara Skipped View (tail)
Skipped: dependency coastline-prepare-for-sparc64-niagara failed (or also skipped).
sparc64/ultra Skipped View (tail)
Skipped: dependency coastline-prepare-for-sparc64-ultra failed (or also skipped).

pcc(back to top)

Architecture Result Download Log Duration
Tarball fetch OK View (tail) 6 s
   300K .......... .......... .......... .......... .......... 54%  398K 1s
   350K .......... .......... .......... .......... .......... 62%  765K 1s
   400K .......... .......... .......... .......... .......... 70%  397K 0s
   450K .......... .......... .......... .......... .......... 78%  770K 0s
   500K .......... .......... .......... .......... .......... 86%  398K 0s
   550K .......... .......... .......... .......... .......... 94%  767K 0s
   600K .......... .......... .......... .......              100%  149K=1.5s

2018-05-11 01:17:34 (418 KB/s) - ‘/var/lib/helenos-ci/nightly/tmp-ci/mirror/sources/pcc-1.0.0.tgz’ saved [652308]

amd64 Skipped View (tail)
Skipped: dependency coastline-prepare-for-amd64 failed (or also skipped).
arm32/beagleboardxm Skipped View (tail)
Skipped: dependency coastline-prepare-for-arm32-beagleboardxm failed (or also skipped).
arm32/beaglebone Skipped View (tail)
Skipped: dependency coastline-prepare-for-arm32-beaglebone failed (or also skipped).
arm32/gta02 Skipped View (tail)
Skipped: dependency coastline-prepare-for-arm32-gta02 failed (or also skipped).
arm32/integratorcp Skipped View (tail)
Skipped: dependency coastline-prepare-for-arm32-integratorcp failed (or also skipped).
arm32/raspberrypi Skipped View (tail)
Skipped: dependency coastline-prepare-for-arm32-raspberrypi failed (or also skipped).
ia32 Skipped View (tail)
Skipped: dependency coastline-prepare-for-ia32 failed (or also skipped).
ia64/i460GX Skipped View (tail)
Skipped: dependency coastline-prepare-for-ia64-i460GX failed (or also skipped).
ia64/ski Skipped View (tail)
Skipped: dependency coastline-prepare-for-ia64-ski failed (or also skipped).
mips32/malta-be Skipped View (tail)
Skipped: dependency coastline-prepare-for-mips32-malta-be failed (or also skipped).
mips32/malta-le Skipped View (tail)
Skipped: dependency coastline-prepare-for-mips32-malta-le failed (or also skipped).
mips32/msim Skipped View (tail)
Skipped: dependency coastline-prepare-for-mips32-msim failed (or also skipped).
ppc32 Skipped View (tail)
Skipped: dependency coastline-prepare-for-ppc32 failed (or also skipped).
riscv64 Skipped View (tail)
Skipped: dependency coastline-prepare-for-riscv64 failed (or also skipped).
sparc64/niagara Skipped View (tail)
Skipped: dependency coastline-prepare-for-sparc64-niagara failed (or also skipped).
sparc64/ultra Skipped View (tail)
Skipped: dependency coastline-prepare-for-sparc64-ultra failed (or also skipped).

python2(back to top)

Architecture Result Download Log Duration
Tarball fetch OK View (tail) 1 s
  9850K .......... .......... .......... .......... .......... 97% 70.0M 0s
  9900K .......... .......... .......... .......... .......... 97% 35.9M 0s
  9950K .......... .......... .......... .......... .......... 98% 25.9M 0s
 10000K .......... .......... .......... .......... .......... 98% 26.1M 0s
 10050K .......... .......... .......... .......... .......... 99% 56.3M 0s
 10100K .......... .......... .......... .......... .......... 99% 32.2M 0s
 10150K .......... .......... .......... ......               100% 29.8M=0.6s

2018-05-11 01:17:40 (16.9 MB/s) - ‘/var/lib/helenos-ci/nightly/tmp-ci/mirror/sources/Python-2.7.6.tar.xz’ saved [10431288/10431288]

amd64 Skipped View (tail)
Skipped: dependency coastline-build-fdlibm-for-amd64 failed (or also skipped).
arm32/beagleboardxm Skipped View (tail)
Skipped: dependency coastline-build-fdlibm-for-arm32-beagleboardxm failed (or also skipped).
arm32/beaglebone Skipped View (tail)
Skipped: dependency coastline-build-fdlibm-for-arm32-beaglebone failed (or also skipped).
arm32/gta02 Skipped View (tail)
Skipped: dependency coastline-build-fdlibm-for-arm32-gta02 failed (or also skipped).
arm32/integratorcp Skipped View (tail)
Skipped: dependency coastline-build-fdlibm-for-arm32-integratorcp failed (or also skipped).
arm32/raspberrypi Skipped View (tail)
Skipped: dependency coastline-build-fdlibm-for-arm32-raspberrypi failed (or also skipped).
ia32 Skipped View (tail)
Skipped: dependency coastline-build-fdlibm-for-ia32 failed (or also skipped).
ia64/i460GX Skipped View (tail)
Skipped: dependency coastline-build-fdlibm-for-ia64-i460GX failed (or also skipped).
ia64/ski Skipped View (tail)
Skipped: dependency coastline-build-fdlibm-for-ia64-ski failed (or also skipped).
mips32/malta-be Skipped View (tail)
Skipped: dependency coastline-build-fdlibm-for-mips32-malta-be failed (or also skipped).
mips32/malta-le Skipped View (tail)
Skipped: dependency coastline-build-fdlibm-for-mips32-malta-le failed (or also skipped).
mips32/msim Skipped View (tail)
Skipped: dependency coastline-build-fdlibm-for-mips32-msim failed (or also skipped).
ppc32 Skipped View (tail)
Skipped: dependency coastline-build-fdlibm-for-ppc32 failed (or also skipped).
riscv64 Skipped View (tail)
Skipped: dependency coastline-build-fdlibm-for-riscv64 failed (or also skipped).
sparc64/niagara Skipped View (tail)
Skipped: dependency coastline-build-fdlibm-for-sparc64-niagara failed (or also skipped).
sparc64/ultra Skipped View (tail)
Skipped: dependency coastline-build-fdlibm-for-sparc64-ultra failed (or also skipped).

zlib(back to top)

Architecture Result Download Log Duration
Tarball fetch OK View (tail) 1 s
   250K .......... .......... .......... .......... .......... 50% 88.4M 1s
   300K .......... .......... .......... .......... .......... 58% 81.8M 0s
   350K .......... .......... .......... .......... .......... 67% 25.1M 0s
   400K .......... .......... .......... .......... .......... 75%  317K 0s
   450K .......... .......... .......... .......... .......... 84% 91.2M 0s
   500K .......... .......... .......... .......... .......... 92%  107M 0s
   550K .......... .......... .......... .......... ...       100% 74.1M=0.8s

2018-05-11 01:17:35 (735 KB/s) - ‘/var/lib/helenos-ci/nightly/tmp-ci/mirror/sources/zlib-1.2.11.tar.gz’ saved [607698/607698]

amd64 Skipped View (tail)
Skipped: dependency coastline-prepare-for-amd64 failed (or also skipped).
arm32/beagleboardxm Skipped View (tail)
Skipped: dependency coastline-prepare-for-arm32-beagleboardxm failed (or also skipped).
arm32/beaglebone Skipped View (tail)
Skipped: dependency coastline-prepare-for-arm32-beaglebone failed (or also skipped).
arm32/gta02 Skipped View (tail)
Skipped: dependency coastline-prepare-for-arm32-gta02 failed (or also skipped).
arm32/integratorcp Skipped View (tail)
Skipped: dependency coastline-prepare-for-arm32-integratorcp failed (or also skipped).
arm32/raspberrypi Skipped View (tail)
Skipped: dependency coastline-prepare-for-arm32-raspberrypi failed (or also skipped).
ia32 Skipped View (tail)
Skipped: dependency coastline-prepare-for-ia32 failed (or also skipped).
ia64/i460GX Skipped View (tail)
Skipped: dependency coastline-prepare-for-ia64-i460GX failed (or also skipped).
ia64/ski Skipped View (tail)
Skipped: dependency coastline-prepare-for-ia64-ski failed (or also skipped).
mips32/malta-be Skipped View (tail)
Skipped: dependency coastline-prepare-for-mips32-malta-be failed (or also skipped).
mips32/malta-le Skipped View (tail)
Skipped: dependency coastline-prepare-for-mips32-malta-le failed (or also skipped).
mips32/msim Skipped View (tail)
Skipped: dependency coastline-prepare-for-mips32-msim failed (or also skipped).
ppc32 Skipped View (tail)
Skipped: dependency coastline-prepare-for-ppc32 failed (or also skipped).
riscv64 Skipped View (tail)
Skipped: dependency coastline-prepare-for-riscv64 failed (or also skipped).
sparc64/niagara Skipped View (tail)
Skipped: dependency coastline-prepare-for-sparc64-niagara failed (or also skipped).
sparc64/ultra Skipped View (tail)
Skipped: dependency coastline-prepare-for-sparc64-ultra failed (or also skipped).

Per-scenario details(back to top)

base/fs.test(back to top)

Architecture Result Download Log Duration
amd64 Skipped View (tail)
Skipped: dependency helenos-build-amd64 failed (or also skipped).
arm32/integratorcp Skipped View (tail)
Skipped: dependency helenos-build-arm32-integratorcp failed (or also skipped).
ia32 Skipped View (tail)
Skipped: dependency helenos-build-ia32 failed (or also skipped).
ppc32 Skipped View (tail)
Skipped: dependency helenos-build-ppc32 failed (or also skipped).

base/tester_malloc1.test(back to top)

Architecture Result Download Log Duration
amd64 Skipped View (tail)
Skipped: dependency helenos-build-amd64 failed (or also skipped).
arm32/integratorcp Skipped View (tail)
Skipped: dependency helenos-build-arm32-integratorcp failed (or also skipped).
ia32 Skipped View (tail)
Skipped: dependency helenos-build-ia32 failed (or also skipped).
ppc32 Skipped View (tail)
Skipped: dependency helenos-build-ppc32 failed (or also skipped).

boot.test(back to top)

Architecture Result Download Log Duration
amd64 Skipped View (tail)
Skipped: dependency helenos-build-amd64 failed (or also skipped).
arm32/integratorcp Skipped View (tail)
Skipped: dependency helenos-build-arm32-integratorcp failed (or also skipped).
ia32 Skipped View (tail)
Skipped: dependency helenos-build-ia32 failed (or also skipped).
ppc32 Skipped View (tail)
Skipped: dependency helenos-build-ppc32 failed (or also skipped).

coast/gcc/version.test(back to top)

Architecture Result Download Log Duration
amd64 Skipped View (tail)
Skipped: dependency extra-amd64-with-gcc failed (or also skipped).
arm32/integratorcp Skipped View (tail)
Skipped: dependency extra-arm32-integratorcp-with-gcc failed (or also skipped).
ia32 Skipped View (tail)
Skipped: dependency extra-ia32-with-gcc failed (or also skipped).
ppc32 Skipped View (tail)
Skipped: dependency extra-ppc32-with-gcc failed (or also skipped).

coast/libgmp/smoke.test(back to top)

Architecture Result Download Log Duration
amd64 Skipped View (tail)
Skipped: dependency extra-amd64-with-libgmp failed (or also skipped).
arm32/integratorcp Skipped View (tail)
Skipped: dependency extra-arm32-integratorcp-with-libgmp failed (or also skipped).
ia32 Skipped View (tail)
Skipped: dependency extra-ia32-with-libgmp failed (or also skipped).
ppc32 Skipped View (tail)
Skipped: dependency extra-ppc32-with-libgmp failed (or also skipped).

coast/libiconv/version.test(back to top)

Architecture Result Download Log Duration
amd64 Skipped View (tail)
Skipped: dependency extra-amd64-with-libiconv failed (or also skipped).
arm32/integratorcp Skipped View (tail)
Skipped: dependency extra-arm32-integratorcp-with-libiconv failed (or also skipped).
ia32 Skipped View (tail)
Skipped: dependency extra-ia32-with-libiconv failed (or also skipped).
ppc32 Skipped View (tail)
Skipped: dependency extra-ppc32-with-libiconv failed (or also skipped).

coast/libisl/smoke.test(back to top)

Architecture Result Download Log Duration
amd64 Skipped View (tail)
Skipped: dependency extra-amd64-with-libisl failed (or also skipped).
arm32/integratorcp Skipped View (tail)
Skipped: dependency extra-arm32-integratorcp-with-libisl failed (or also skipped).
ia32 Skipped View (tail)
Skipped: dependency extra-ia32-with-libisl failed (or also skipped).
ppc32 Skipped View (tail)
Skipped: dependency extra-ppc32-with-libisl failed (or also skipped).

coast/libmpc/smoke.test(back to top)

Architecture Result Download Log Duration
amd64 Skipped View (tail)
Skipped: dependency extra-amd64-with-libmpc failed (or also skipped).
arm32/integratorcp Skipped View (tail)
Skipped: dependency extra-arm32-integratorcp-with-libmpc failed (or also skipped).
ia32 Skipped View (tail)
Skipped: dependency extra-ia32-with-libmpc failed (or also skipped).
ppc32 Skipped View (tail)
Skipped: dependency extra-ppc32-with-libmpc failed (or also skipped).

coast/libmpfr/smoke.test(back to top)

Architecture Result Download Log Duration
amd64 Skipped View (tail)
Skipped: dependency extra-amd64-with-libmpfr failed (or also skipped).
arm32/integratorcp Skipped View (tail)
Skipped: dependency extra-arm32-integratorcp-with-libmpfr failed (or also skipped).
ia32 Skipped View (tail)
Skipped: dependency extra-ia32-with-libmpfr failed (or also skipped).
ppc32 Skipped View (tail)
Skipped: dependency extra-ppc32-with-libmpfr failed (or also skipped).

coast/libpng/pngtest.test(back to top)

Architecture Result Download Log Duration
amd64 Skipped View (tail)
Skipped: dependency extra-amd64-with-libpng failed (or also skipped).
arm32/integratorcp Skipped View (tail)
Skipped: dependency extra-arm32-integratorcp-with-libpng failed (or also skipped).
ia32 Skipped View (tail)
Skipped: dependency extra-ia32-with-libpng failed (or also skipped).
ppc32 Skipped View (tail)
Skipped: dependency extra-ppc32-with-libpng failed (or also skipped).

coast/pcc/hello.test(back to top)

Architecture Result Download Log Duration
amd64 Skipped View (tail)
Skipped: dependency extra-amd64-with-binutils-pcc failed (or also skipped).
arm32/integratorcp Skipped View (tail)
Skipped: dependency extra-arm32-integratorcp-with-binutils-pcc failed (or also skipped).
ia32 Skipped View (tail)
Skipped: dependency extra-ia32-with-binutils-pcc failed (or also skipped).
ppc32 Skipped View (tail)
Skipped: dependency extra-ppc32-with-binutils-pcc failed (or also skipped).

coast/pcc/version.test(back to top)

Architecture Result Download Log Duration
amd64 Skipped View (tail)
Skipped: dependency extra-amd64-with-pcc failed (or also skipped).
arm32/integratorcp Skipped View (tail)
Skipped: dependency extra-arm32-integratorcp-with-pcc failed (or also skipped).
ia32 Skipped View (tail)
Skipped: dependency extra-ia32-with-pcc failed (or also skipped).
ppc32 Skipped View (tail)
Skipped: dependency extra-ppc32-with-pcc failed (or also skipped).

coast/python2/hello.test(back to top)

Architecture Result Download Log Duration
amd64 Skipped View (tail)
Skipped: dependency extra-amd64-with-python2 failed (or also skipped).
arm32/integratorcp Skipped View (tail)
Skipped: dependency extra-arm32-integratorcp-with-python2 failed (or also skipped).
ia32 Skipped View (tail)
Skipped: dependency extra-ia32-with-python2 failed (or also skipped).
ppc32 Skipped View (tail)
Skipped: dependency extra-ppc32-with-python2 failed (or also skipped).

coast/python2/version.test(back to top)

Architecture Result Download Log Duration
amd64 Skipped View (tail)
Skipped: dependency extra-amd64-with-python2 failed (or also skipped).
arm32/integratorcp Skipped View (tail)
Skipped: dependency extra-arm32-integratorcp-with-python2 failed (or also skipped).
ia32 Skipped View (tail)
Skipped: dependency extra-ia32-with-python2 failed (or also skipped).
ppc32 Skipped View (tail)
Skipped: dependency extra-ppc32-with-python2 failed (or also skipped).

coast/zlib/minigzip.test(back to top)

Architecture Result Download Log Duration
amd64 Skipped View (tail)
Skipped: dependency extra-amd64-with-zlib failed (or also skipped).
arm32/integratorcp Skipped View (tail)
Skipped: dependency extra-arm32-integratorcp-with-zlib failed (or also skipped).
ia32 Skipped View (tail)
Skipped: dependency extra-ia32-with-zlib failed (or also skipped).
ppc32 Skipped View (tail)
Skipped: dependency extra-ppc32-with-zlib failed (or also skipped).