HelenOS continuous integration testing

Build 18 from ()

Summary results

Task Success Details (total = ok + failed + skipped)
Repository checkouts 100 % 2 = 2 + 0 + 0
HelenOS builds 100 % 16 = 16 + 0 + 0
Tarball fetches for Coastline 100 % 14 = 14 + 0 + 0
Coastline builds 18 % 68 = 12 + 10 + 46
Testing scenarios 75 % 8 = 6 + 0 + 2

Summary matrix(back to top)

amd64 arm32 beagle­board­xm arm32 beagle­bone arm32 gta02 arm32 inte­gra­torcp arm32 rasp­ber­ry­pi ia32 ia64 i460GX ia64 ski mips32 malta­-be mips32 malta­-le mips32 msim ppc32 sparc64 niagara sparc64 ultra special abs32le
HelenOS OK OK OK OK OK OK OK OK OK OK OK OK OK OK OK OK
binutils N/A N/A Skipped N/A N/A N/A Skipped Failed N/A Skipped OK N/A N/A N/A N/A N/A
fdlibm N/A N/A Skipped N/A N/A N/A Skipped Failed N/A Skipped OK N/A N/A N/A N/A N/A
gcc N/A N/A N/A N/A N/A N/A Skipped Skipped N/A Skipped Failed N/A N/A N/A N/A N/A
jainja N/A N/A Skipped N/A N/A N/A Skipped Failed N/A Skipped OK N/A N/A N/A N/A N/A
libgmp N/A N/A Skipped N/A N/A N/A Skipped Failed N/A Skipped OK N/A N/A N/A N/A N/A
libiconv N/A N/A Skipped N/A N/A N/A Skipped Failed N/A Skipped OK N/A N/A N/A N/A N/A
libisl N/A N/A Skipped N/A N/A N/A Skipped Skipped N/A Skipped OK N/A N/A N/A N/A N/A
libmpc N/A N/A N/A N/A N/A N/A Skipped Skipped N/A Skipped OK N/A N/A N/A N/A N/A
libmpfr N/A N/A Skipped N/A N/A N/A Skipped Skipped N/A Skipped OK N/A N/A N/A N/A N/A
libpng N/A N/A Skipped N/A N/A N/A Skipped Skipped N/A Skipped OK N/A N/A N/A N/A N/A
msim N/A N/A Skipped N/A N/A N/A Skipped OK N/A Skipped OK N/A N/A N/A N/A N/A
pcc N/A N/A Skipped N/A N/A N/A Skipped Failed N/A Skipped Failed N/A N/A N/A N/A N/A
python2 N/A N/A Skipped N/A N/A N/A Skipped Skipped N/A Skipped Failed N/A N/A N/A N/A N/A
zlib N/A N/A Skipped N/A N/A N/A Skipped Failed N/A Skipped OK N/A N/A N/A N/A N/A

Miscellaneous

List of failed tasks (back to top)

Task Component Architecture Log Duration
Harbour build binutils ia64/i460GX View 0 s
Harbour build fdlibm ia64/i460GX View (tail) 7 s
  ^~
/usr/local/cross/ia64/bin/ia64-pc-linux-gnu-ar cru libfdm.a k_standard.o k_rem_pio2.o k_cos.o k_sin.o k_tan.o e_acos.o e_acosh.o e_asin.o e_atan2.o e_atanh.o e_cosh.o e_exp.o e_fmod.o e_gamma.o e_gamma_r.o e_hypot.o e_j0.o e_j1.o e_jn.o e_lgamma.o e_lgamma_r.o e_log.o e_log10.o e_pow.o e_rem_pio2.o e_remainder.o e_scalb.o e_sinh.o e_sqrt.o w_acos.o w_acosh.o w_asin.o w_atan2.o w_atanh.o w_cosh.o w_exp.o w_fmod.o w_gamma.o w_gamma_r.o w_hypot.o w_j0.o w_j1.o w_jn.o w_lgamma.o w_lgamma_r.o w_log.o w_log10.o w_pow.o w_remainder.o w_scalb.o w_sinh.o w_sqrt.o s_asinh.o s_atan.o s_cbrt.o s_ceil.o s_copysign.o s_cos.o s_erf.o s_expm1.o s_fabs.o s_finite.o s_floor.o s_frexp.o s_ilogb.o s_isnan.o s_ldexp.o s_lib_version.o s_log1p.o s_logb.o s_matherr.o s_modf.o s_nextafter.o s_rint.o s_scalbn.o s_signgam.o s_significand.o s_sin.o s_tan.o s_tanh.o
/usr/local/cross/ia64/bin/ia64-pc-linux-gnu-ranlib libfdm.a || true
>>> Packaging...
[hsct]: "cp" "fdlibm53/libfdm.a" "/home/accounts/helenos-ci/nightly/tmp-ci/build/ia64-i460GX/coast/libs/" 
[hsct]: "mkdir" "-p" "/home/accounts/helenos-ci/nightly/tmp-ci/build/ia64-i460GX/coast/dist//fdlibm/lib" 
[hsct]: "cp" "fdlibm53/libfdm.a" "/home/accounts/helenos-ci/nightly/tmp-ci/build/ia64-i460GX/coast/dist//fdlibm/lib/" 
>>> Creating the tarball...
xz: (stdin): Cannot allocate memory
[hsct]: Error: Archiving failed!
Harbour build gcc mips32/malta-le View (tail) 10 min 22 s
/usr/local/cross/mips32/lib/gcc/mipsel-linux-gnu/6.1.0/../../../../mipsel-linux-gnu/bin/as: out of memory allocating 4064 bytes after a total of 290816 bytes
{standard input}: Assembler messages:
{standard input}:1: Fatal error: can't close sched-deps.o: Memory exhausted
virtual memory exhausted: Cannot allocate memory
Makefile:1074: recipe for target 'sched-deps.o' failed
make[1]: *** [sched-deps.o] Error 2
make[1]: Leaving directory '/home/accounts/helenos-ci/nightly/tmp-ci/build/mips32-malta-le/coast/build/gcc/build/gcc'
Makefile:5246: recipe for target 'all-gcc' failed
make: *** [all-gcc] Error 2
[hsct]: Error: Build failed!
Harbour build jainja ia64/i460GX View 0 s
Harbour build libgmp ia64/i460GX View 0 s
Harbour build libiconv ia64/i460GX View (tail) 4 s
checking if /usr/local/cross/ia64/bin/ia64-pc-linux-gnu-gcc supports -c -o file.o... (cached) no
checking if we can lock with hard links... yes
checking whether the /usr/local/cross/ia64/bin/ia64-pc-linux-gnu-gcc linker (/usr/local/cross/ia64/bin/ia64-pc-linux-gnu-ld) supports shared libraries... yes
checking dynamic linker characteristics... ./configure: fork: Cannot allocate memory
./configure: fork: Cannot allocate memory
[hsct]: "sed" "s#cp .libs/libiconv.so preloadable_libiconv.so#touch preloadable_libiconv.so#" "-i" "preload/Makefile" 
sed: can't read preload/Makefile: No such file or directory
[hsct]: "make" "STATIC_ONLY=y" 
make: *** No targets specified and no makefile found.  Stop.
[hsct]: Error: Build failed!
Harbour build pcc ia64/i460GX View 0 s
Harbour build pcc mips32/malta-le View (tail) 1 s
                   ^~~~~~~~~
cc.c: In function 'main':
cc.c:366:21: error: 'VERSSTR' undeclared (first use in this function)
      printf("%s\n", VERSSTR);
                     ^~~~~~~
cc.c:366:21: note: each undeclared identifier is reported only once for each function it appears in
/home/accounts/helenos-ci/nightly/tmp-ci/build/mips32-malta-le/helenos/uspace/Makefile.common:385: recipe for target 'cc.o' failed
make: *** [cc.o] Error 1
make: Leaving directory '/home/accounts/helenos-ci/nightly/tmp-ci/build/mips32-malta-le/coast/build/pcc/pcc-1.0.0/cc/cc'
[hsct]: Error: Build failed!
Harbour build python2 mips32/malta-le View (tail) 4 min 39 s
/home/accounts/helenos-ci/nightly/tmp-ci/build/mips32-malta-le/coast/build/python2/python-cross/./Modules/posixmodule.c:2506: undefined reference to `readdir'
/home/accounts/helenos-ci/nightly/tmp-ci/build/mips32-malta-le/coast/build/python2/python-cross/./Modules/posixmodule.c:2506: undefined reference to `readdir'
/home/accounts/helenos-ci/nightly/tmp-ci/build/mips32-malta-le/coast/build/python2/python-cross/./Modules/posixmodule.c:2556: undefined reference to `closedir'
/home/accounts/helenos-ci/nightly/tmp-ci/build/mips32-malta-le/coast/build/python2/python-cross/./Modules/posixmodule.c:2556: undefined reference to `closedir'
/home/accounts/helenos-ci/nightly/tmp-ci/build/mips32-malta-le/coast/build/python2/python-cross/./Modules/posixmodule.c:2513: undefined reference to `closedir'
/home/accounts/helenos-ci/nightly/tmp-ci/build/mips32-malta-le/coast/build/python2/python-cross/./Modules/posixmodule.c:2513: undefined reference to `closedir'
collect2: error: ld returned 1 exit status
Makefile:458: recipe for target 'python' failed
make: *** [python] Error 1
[hsct]: Error: Build failed!
Harbour build zlib ia64/i460GX View 0 s

HelenOS (back to top)

Architecture Result Download Log Duration
amd64 OK HelenOS boot image View (tail) 2 min 53 s
 40.27% done, estimate finish Tue Jun  6 01:49:19 2017
 80.41% done, estimate finish Tue Jun  6 01:49:19 2017
Total translation table size: 2048
Total rockridge attributes bytes: 25679
Total directory bytes: 43008
Path table size(bytes): 50
Max brk space used 44000
12437 extents written (24 MB)
make[2]: Leaving directory '/home/accounts/helenos-ci/nightly/tmp-ci/build/amd64/helenos/boot'
make[1]: Leaving directory '/home/accounts/helenos-ci/nightly/tmp-ci/build/amd64/helenos/boot'
arm32/beagleboardxm OK HelenOS boot image View (tail) 3 min 23 s
/usr/local/cross/arm32/bin/arm-linux-gnueabi-ld -n --fatal-warnings -T arch/arm32/_link.ld -M -Map image.map -o image.raw kernel.co ns.co loader.co init.co locsrv.co rd.co vfs.co logger.co ext4fs.co initrd.co arch/arm32/src/asm.o arch/arm32/src/eabi.o arch/arm32/src/main.o arch/arm32/src/mm.o arch/arm32/src/putchar.o arch/arm32/src/_components.o genarch/src/division.o generic/src/memstr.o generic/src/printf_core.o generic/src/vprintf.o generic/src/printf.o generic/src/str.o generic/src/version.o generic/src/inflate.o
/usr/local/cross/arm32/bin/arm-linux-gnueabi-objcopy -O elf32-littlearm image.raw image.boot
[ -f Makefile.depend ] && cp -a Makefile.depend Makefile.depend.prev
make[2]: Leaving directory '/home/accounts/helenos-ci/nightly/tmp-ci/build/arm32-beagleboardxm/helenos/boot'
make -r -f Makefile.uboot PRECHECK=
make[2]: Entering directory '/home/accounts/helenos-ci/nightly/tmp-ci/build/arm32-beagleboardxm/helenos/boot'
/usr/local/cross/arm32/bin/arm-linux-gnueabi-objcopy -O binary image.boot image.bin
../tools/mkuimage.py -name "HelenOS-0.7.0" -laddr 0x80000000 -saddr 0x80000000 -ostype 2 image.bin ../uImage.bin
make[2]: Leaving directory '/home/accounts/helenos-ci/nightly/tmp-ci/build/arm32-beagleboardxm/helenos/boot'
make[1]: Leaving directory '/home/accounts/helenos-ci/nightly/tmp-ci/build/arm32-beagleboardxm/helenos/boot'
arm32/beaglebone OK HelenOS boot image View (tail) 3 min 20 s
/usr/local/cross/arm32/bin/arm-linux-gnueabi-ld -n --fatal-warnings -T arch/arm32/_link.ld -M -Map image.map -o image.raw kernel.co ns.co loader.co init.co locsrv.co rd.co vfs.co logger.co ext4fs.co initrd.co arch/arm32/src/asm.o arch/arm32/src/eabi.o arch/arm32/src/main.o arch/arm32/src/mm.o arch/arm32/src/putchar.o arch/arm32/src/_components.o genarch/src/division.o generic/src/memstr.o generic/src/printf_core.o generic/src/vprintf.o generic/src/printf.o generic/src/str.o generic/src/version.o generic/src/inflate.o
/usr/local/cross/arm32/bin/arm-linux-gnueabi-objcopy -O elf32-littlearm image.raw image.boot
[ -f Makefile.depend ] && cp -a Makefile.depend Makefile.depend.prev
make[2]: Leaving directory '/home/accounts/helenos-ci/nightly/tmp-ci/build/arm32-beaglebone/helenos/boot'
make -r -f Makefile.uboot PRECHECK=
make[2]: Entering directory '/home/accounts/helenos-ci/nightly/tmp-ci/build/arm32-beaglebone/helenos/boot'
/usr/local/cross/arm32/bin/arm-linux-gnueabi-objcopy -O binary image.boot image.bin
../tools/mkuimage.py -name "HelenOS-0.7.0" -laddr 0x80000000 -saddr 0x80000000 -ostype 2 image.bin ../uImage.bin
make[2]: Leaving directory '/home/accounts/helenos-ci/nightly/tmp-ci/build/arm32-beaglebone/helenos/boot'
make[1]: Leaving directory '/home/accounts/helenos-ci/nightly/tmp-ci/build/arm32-beaglebone/helenos/boot'
arm32/gta02 OK HelenOS boot image View (tail) 3 min 25 s
/usr/local/cross/arm32/bin/arm-linux-gnueabi-ld -n --fatal-warnings -T arch/arm32/_link.ld -M -Map image.map -o image.raw kernel.co ns.co loader.co init.co locsrv.co rd.co vfs.co logger.co ext4fs.co initrd.co arch/arm32/src/asm.o arch/arm32/src/eabi.o arch/arm32/src/main.o arch/arm32/src/mm.o arch/arm32/src/putchar.o arch/arm32/src/_components.o genarch/src/division.o generic/src/memstr.o generic/src/printf_core.o generic/src/vprintf.o generic/src/printf.o generic/src/str.o generic/src/version.o generic/src/inflate.o
/usr/local/cross/arm32/bin/arm-linux-gnueabi-objcopy -O elf32-littlearm image.raw image.boot
[ -f Makefile.depend ] && cp -a Makefile.depend Makefile.depend.prev
make[2]: Leaving directory '/home/accounts/helenos-ci/nightly/tmp-ci/build/arm32-gta02/helenos/boot'
make -r -f Makefile.uboot PRECHECK=
make[2]: Entering directory '/home/accounts/helenos-ci/nightly/tmp-ci/build/arm32-gta02/helenos/boot'
/usr/local/cross/arm32/bin/arm-linux-gnueabi-objcopy -O binary image.boot image.bin
../tools/mkuimage.py -name "HelenOS-0.7.0" -laddr 0x30008000 -saddr 0x30008000 -ostype 5 image.bin ../uImage.bin
make[2]: Leaving directory '/home/accounts/helenos-ci/nightly/tmp-ci/build/arm32-gta02/helenos/boot'
make[1]: Leaving directory '/home/accounts/helenos-ci/nightly/tmp-ci/build/arm32-gta02/helenos/boot'
arm32/integratorcp OK HelenOS boot image View (tail) 3 min 22 s
/usr/local/cross/arm32/bin/arm-linux-gnueabi-gcc -DBOOT -DRELEASE=0.7.0 "-DCOPYRIGHT=Copyright (c) 2001-2017 HelenOS project" "-DNAME=Parabolic Potassium" -D__32_BITS__ -D__LE__ -Igeneric/include -I../abi/include -O3 -imacros ../config.h -fexec-charset=UTF-8 -fwide-exec-charset=UTF-32LE -finput-charset=UTF-8 -ffreestanding -fno-builtin -nostdlib -nostdinc -Wall -Wextra -Wno-unused-parameter -Wmissing-prototypes -std=gnu99 -Werror-implicit-function-declaration -Wwrite-strings -pipe -Werror -march=armv5 -mno-unaligned-access -c generic/src/printf.c -o generic/src/printf.o
/usr/local/cross/arm32/bin/arm-linux-gnueabi-gcc -DBOOT -DRELEASE=0.7.0 "-DCOPYRIGHT=Copyright (c) 2001-2017 HelenOS project" "-DNAME=Parabolic Potassium" -D__32_BITS__ -D__LE__ -Igeneric/include -I../abi/include -O3 -imacros ../config.h -fexec-charset=UTF-8 -fwide-exec-charset=UTF-32LE -finput-charset=UTF-8 -ffreestanding -fno-builtin -nostdlib -nostdinc -Wall -Wextra -Wno-unused-parameter -Wmissing-prototypes -std=gnu99 -Werror-implicit-function-declaration -Wwrite-strings -pipe -Werror -march=armv5 -mno-unaligned-access -c generic/src/str.c -o generic/src/str.o
/usr/local/cross/arm32/bin/arm-linux-gnueabi-gcc -DBOOT -DRELEASE=0.7.0 "-DCOPYRIGHT=Copyright (c) 2001-2017 HelenOS project" "-DNAME=Parabolic Potassium" -D__32_BITS__ -D__LE__ -Igeneric/include -I../abi/include -O3 -imacros ../config.h -fexec-charset=UTF-8 -fwide-exec-charset=UTF-32LE -finput-charset=UTF-8 -ffreestanding -fno-builtin -nostdlib -nostdinc -Wall -Wextra -Wno-unused-parameter -Wmissing-prototypes -std=gnu99 -Werror-implicit-function-declaration -Wwrite-strings -pipe -Werror -march=armv5 -mno-unaligned-access -c generic/src/version.c -o generic/src/version.o
/usr/local/cross/arm32/bin/arm-linux-gnueabi-gcc -DBOOT -DRELEASE=0.7.0 "-DCOPYRIGHT=Copyright (c) 2001-2017 HelenOS project" "-DNAME=Parabolic Potassium" -D__32_BITS__ -D__LE__ -Igeneric/include -I../abi/include -O3 -imacros ../config.h -fexec-charset=UTF-8 -fwide-exec-charset=UTF-32LE -finput-charset=UTF-8 -ffreestanding -fno-builtin -nostdlib -nostdinc -Wall -Wextra -Wno-unused-parameter -Wmissing-prototypes -std=gnu99 -Werror-implicit-function-declaration -Wwrite-strings -pipe -Werror -march=armv5 -mno-unaligned-access -c generic/src/inflate.c -o generic/src/inflate.o
/usr/local/cross/arm32/bin/arm-linux-gnueabi-gcc -DBOOT -DRELEASE=0.7.0 "-DCOPYRIGHT=Copyright (c) 2001-2017 HelenOS project" "-DNAME=Parabolic Potassium" -D__32_BITS__ -D__LE__ -Igeneric/include -I../abi/include -O3 -imacros ../config.h -fexec-charset=UTF-8 -fwide-exec-charset=UTF-32LE -finput-charset=UTF-8 -ffreestanding -fno-builtin -nostdlib -nostdinc -Wall -Wextra -Wno-unused-parameter -Wmissing-prototypes -std=gnu99 -Werror-implicit-function-declaration -Wwrite-strings -pipe -Werror -D__ASM__ -D__LINKER__ -E -x c arch/arm32/_link.ld.comp | grep -v "^\#" > arch/arm32/_link.ld
/usr/local/cross/arm32/bin/arm-linux-gnueabi-ld -n --fatal-warnings -T arch/arm32/_link.ld -M -Map image.map -o image.raw kernel.co ns.co loader.co init.co locsrv.co rd.co vfs.co logger.co ext4fs.co initrd.co arch/arm32/src/asm.o arch/arm32/src/eabi.o arch/arm32/src/main.o arch/arm32/src/mm.o arch/arm32/src/putchar.o arch/arm32/src/_components.o genarch/src/division.o generic/src/memstr.o generic/src/printf_core.o generic/src/vprintf.o generic/src/printf.o generic/src/str.o generic/src/version.o generic/src/inflate.o
/usr/local/cross/arm32/bin/arm-linux-gnueabi-objcopy -O elf32-littlearm image.raw ../image.boot
[ -f Makefile.depend ] && cp -a Makefile.depend Makefile.depend.prev
make[2]: Leaving directory '/home/accounts/helenos-ci/nightly/tmp-ci/build/arm32-integratorcp/helenos/boot'
make[1]: Leaving directory '/home/accounts/helenos-ci/nightly/tmp-ci/build/arm32-integratorcp/helenos/boot'
arm32/raspberrypi OK HelenOS boot image View (tail) 3 min 18 s
/usr/local/cross/arm32/bin/arm-linux-gnueabi-ld -n --fatal-warnings -T arch/arm32/_link.ld -M -Map image.map -o image.raw kernel.co ns.co loader.co init.co locsrv.co rd.co vfs.co logger.co fat.co initrd.co arch/arm32/src/asm.o arch/arm32/src/eabi.o arch/arm32/src/main.o arch/arm32/src/mm.o arch/arm32/src/putchar.o arch/arm32/src/_components.o genarch/src/division.o generic/src/memstr.o generic/src/printf_core.o generic/src/vprintf.o generic/src/printf.o generic/src/str.o generic/src/version.o generic/src/inflate.o
/usr/local/cross/arm32/bin/arm-linux-gnueabi-objcopy -O elf32-littlearm image.raw image.boot
[ -f Makefile.depend ] && cp -a Makefile.depend Makefile.depend.prev
make[2]: Leaving directory '/home/accounts/helenos-ci/nightly/tmp-ci/build/arm32-raspberrypi/helenos/boot'
make -r -f Makefile.uboot PRECHECK=
make[2]: Entering directory '/home/accounts/helenos-ci/nightly/tmp-ci/build/arm32-raspberrypi/helenos/boot'
/usr/local/cross/arm32/bin/arm-linux-gnueabi-objcopy -O binary image.boot image.bin
../tools/mkuimage.py -name "HelenOS-0.7.0" -laddr 0x00008000 -saddr 0x00008000 -ostype 5 image.bin ../uImage.bin
make[2]: Leaving directory '/home/accounts/helenos-ci/nightly/tmp-ci/build/arm32-raspberrypi/helenos/boot'
make[1]: Leaving directory '/home/accounts/helenos-ci/nightly/tmp-ci/build/arm32-raspberrypi/helenos/boot'
ia32 OK HelenOS boot image View (tail) 3 min 8 s
Size of boot image is 64 sectors -> No emulation
 80.58% done, estimate finish Tue Jun  6 01:34:18 2017
Total translation table size: 2048
Total rockridge attributes bytes: 25679
Total directory bytes: 43008
Path table size(bytes): 50
Max brk space used 44000
6220 extents written (12 MB)
make[2]: Leaving directory '/home/accounts/helenos-ci/nightly/tmp-ci/build/ia32/helenos/boot'
make[1]: Leaving directory '/home/accounts/helenos-ci/nightly/tmp-ci/build/ia32/helenos/boot'
ia64/i460GX OK HelenOS boot image View (tail) 5 min 49 s
/usr/local/cross/ia64/bin/ia64-pc-linux-gnu-gcc -DBOOT -DRELEASE=0.7.0 "-DCOPYRIGHT=Copyright (c) 2001-2017 HelenOS project" "-DNAME=Parabolic Potassium" -D__64_BITS__ -D__LE__ -Igeneric/include -I../abi/include -O3 -imacros ../config.h -fexec-charset=UTF-8 -fwide-exec-charset=UTF-32LE -finput-charset=UTF-8 -ffreestanding -fno-builtin -nostdlib -nostdinc -Wall -Wextra -Wno-unused-parameter -Wmissing-prototypes -std=gnu99 -Werror-implicit-function-declaration -Wwrite-strings -pipe -Werror -fno-unwind-tables -mfixed-range=f32-f127 -mno-pic -mno-sdata -c generic/src/printf.c -o generic/src/printf.o
/usr/local/cross/ia64/bin/ia64-pc-linux-gnu-gcc -DBOOT -DRELEASE=0.7.0 "-DCOPYRIGHT=Copyright (c) 2001-2017 HelenOS project" "-DNAME=Parabolic Potassium" -D__64_BITS__ -D__LE__ -Igeneric/include -I../abi/include -O3 -imacros ../config.h -fexec-charset=UTF-8 -fwide-exec-charset=UTF-32LE -finput-charset=UTF-8 -ffreestanding -fno-builtin -nostdlib -nostdinc -Wall -Wextra -Wno-unused-parameter -Wmissing-prototypes -std=gnu99 -Werror-implicit-function-declaration -Wwrite-strings -pipe -Werror -fno-unwind-tables -mfixed-range=f32-f127 -mno-pic -mno-sdata -c generic/src/str.c -o generic/src/str.o
/usr/local/cross/ia64/bin/ia64-pc-linux-gnu-gcc -DBOOT -DRELEASE=0.7.0 "-DCOPYRIGHT=Copyright (c) 2001-2017 HelenOS project" "-DNAME=Parabolic Potassium" -D__64_BITS__ -D__LE__ -Igeneric/include -I../abi/include -O3 -imacros ../config.h -fexec-charset=UTF-8 -fwide-exec-charset=UTF-32LE -finput-charset=UTF-8 -ffreestanding -fno-builtin -nostdlib -nostdinc -Wall -Wextra -Wno-unused-parameter -Wmissing-prototypes -std=gnu99 -Werror-implicit-function-declaration -Wwrite-strings -pipe -Werror -fno-unwind-tables -mfixed-range=f32-f127 -mno-pic -mno-sdata -c generic/src/version.c -o generic/src/version.o
/usr/local/cross/ia64/bin/ia64-pc-linux-gnu-gcc -DBOOT -DRELEASE=0.7.0 "-DCOPYRIGHT=Copyright (c) 2001-2017 HelenOS project" "-DNAME=Parabolic Potassium" -D__64_BITS__ -D__LE__ -Igeneric/include -I../abi/include -O3 -imacros ../config.h -fexec-charset=UTF-8 -fwide-exec-charset=UTF-32LE -finput-charset=UTF-8 -ffreestanding -fno-builtin -nostdlib -nostdinc -Wall -Wextra -Wno-unused-parameter -Wmissing-prototypes -std=gnu99 -Werror-implicit-function-declaration -Wwrite-strings -pipe -Werror -fno-unwind-tables -mfixed-range=f32-f127 -mno-pic -mno-sdata -c generic/src/inflate.c -o generic/src/inflate.o
/usr/local/cross/ia64/bin/ia64-pc-linux-gnu-gcc -DBOOT -DRELEASE=0.7.0 "-DCOPYRIGHT=Copyright (c) 2001-2017 HelenOS project" "-DNAME=Parabolic Potassium" -D__64_BITS__ -D__LE__ -Igeneric/include -I../abi/include -O3 -imacros ../config.h -fexec-charset=UTF-8 -fwide-exec-charset=UTF-32LE -finput-charset=UTF-8 -ffreestanding -fno-builtin -nostdlib -nostdinc -Wall -Wextra -Wno-unused-parameter -Wmissing-prototypes -std=gnu99 -Werror-implicit-function-declaration -Wwrite-strings -pipe -Werror -D__ASM__ -D__LINKER__ -E -x c arch/ia64/_link.ld.comp | grep -v "^\#" > arch/ia64/_link.ld
/usr/local/cross/ia64/bin/ia64-pc-linux-gnu-ld -n --fatal-warnings -T arch/ia64/_link.ld -M -Map image.map -o image.raw kernel.co ns.co loader.co init.co locsrv.co rd.co vfs.co logger.co ext4fs.co initrd.co arch/ia64/src/boot.o arch/ia64/src/asm.o arch/ia64/src/main.o arch/ia64/src/sal.o arch/ia64/src/sal_asm.o arch/ia64/src/pal.o arch/ia64/src/pal_asm.o arch/ia64/src/putchar.o arch/ia64/src/_components.o genarch/src/efi.o genarch/src/division.o generic/src/balloc.o generic/src/memstr.o generic/src/printf_core.o generic/src/vprintf.o generic/src/printf.o generic/src/str.o generic/src/version.o generic/src/inflate.o
/usr/local/cross/ia64/bin/ia64-pc-linux-gnu-objcopy -O elf64-ia64-little image.raw ../image.boot
[ -f Makefile.depend ] && cp -a Makefile.depend Makefile.depend.prev
make[2]: Leaving directory '/home/accounts/helenos-ci/nightly/tmp-ci/build/ia64-i460GX/helenos/boot'
make[1]: Leaving directory '/home/accounts/helenos-ci/nightly/tmp-ci/build/ia64-i460GX/helenos/boot'
ia64/ski OK HelenOS boot image View (tail) 6 min 1 s
/usr/local/cross/ia64/bin/ia64-pc-linux-gnu-gcc -DBOOT -DRELEASE=0.7.0 "-DCOPYRIGHT=Copyright (c) 2001-2017 HelenOS project" "-DNAME=Parabolic Potassium" -D__64_BITS__ -D__LE__ -Igeneric/include -I../abi/include -O3 -imacros ../config.h -fexec-charset=UTF-8 -fwide-exec-charset=UTF-32LE -finput-charset=UTF-8 -ffreestanding -fno-builtin -nostdlib -nostdinc -Wall -Wextra -Wno-unused-parameter -Wmissing-prototypes -std=gnu99 -Werror-implicit-function-declaration -Wwrite-strings -pipe -Werror -fno-unwind-tables -mfixed-range=f32-f127 -mno-pic -mno-sdata -c generic/src/str.c -o generic/src/str.o
/usr/local/cross/ia64/bin/ia64-pc-linux-gnu-gcc -DBOOT -DRELEASE=0.7.0 "-DCOPYRIGHT=Copyright (c) 2001-2017 HelenOS project" "-DNAME=Parabolic Potassium" -D__64_BITS__ -D__LE__ -Igeneric/include -I../abi/include -O3 -imacros ../config.h -fexec-charset=UTF-8 -fwide-exec-charset=UTF-32LE -finput-charset=UTF-8 -ffreestanding -fno-builtin -nostdlib -nostdinc -Wall -Wextra -Wno-unused-parameter -Wmissing-prototypes -std=gnu99 -Werror-implicit-function-declaration -Wwrite-strings -pipe -Werror -fno-unwind-tables -mfixed-range=f32-f127 -mno-pic -mno-sdata -c generic/src/version.c -o generic/src/version.o
/usr/local/cross/ia64/bin/ia64-pc-linux-gnu-gcc -DBOOT -DRELEASE=0.7.0 "-DCOPYRIGHT=Copyright (c) 2001-2017 HelenOS project" "-DNAME=Parabolic Potassium" -D__64_BITS__ -D__LE__ -Igeneric/include -I../abi/include -O3 -imacros ../config.h -fexec-charset=UTF-8 -fwide-exec-charset=UTF-32LE -finput-charset=UTF-8 -ffreestanding -fno-builtin -nostdlib -nostdinc -Wall -Wextra -Wno-unused-parameter -Wmissing-prototypes -std=gnu99 -Werror-implicit-function-declaration -Wwrite-strings -pipe -Werror -fno-unwind-tables -mfixed-range=f32-f127 -mno-pic -mno-sdata -c generic/src/inflate.c -o generic/src/inflate.o
/usr/local/cross/ia64/bin/ia64-pc-linux-gnu-gcc -DBOOT -DRELEASE=0.7.0 "-DCOPYRIGHT=Copyright (c) 2001-2017 HelenOS project" "-DNAME=Parabolic Potassium" -D__64_BITS__ -D__LE__ -Igeneric/include -I../abi/include -O3 -imacros ../config.h -fexec-charset=UTF-8 -fwide-exec-charset=UTF-32LE -finput-charset=UTF-8 -ffreestanding -fno-builtin -nostdlib -nostdinc -Wall -Wextra -Wno-unused-parameter -Wmissing-prototypes -std=gnu99 -Werror-implicit-function-declaration -Wwrite-strings -pipe -Werror -fno-unwind-tables -mfixed-range=f32-f127 -mno-pic -mno-sdata -c arch/ia64/src/ski.c -o arch/ia64/src/ski.o
/usr/local/cross/ia64/bin/ia64-pc-linux-gnu-gcc -DBOOT -DRELEASE=0.7.0 "-DCOPYRIGHT=Copyright (c) 2001-2017 HelenOS project" "-DNAME=Parabolic Potassium" -D__64_BITS__ -D__LE__ -Igeneric/include -I../abi/include -O3 -imacros ../config.h -fexec-charset=UTF-8 -fwide-exec-charset=UTF-32LE -finput-charset=UTF-8 -ffreestanding -fno-builtin -nostdlib -nostdinc -Wall -Wextra -Wno-unused-parameter -Wmissing-prototypes -std=gnu99 -Werror-implicit-function-declaration -Wwrite-strings -pipe -Werror -D__ASM__ -D__LINKER__ -E -x c arch/ia64/_link.ld.comp | grep -v "^\#" > arch/ia64/_link.ld
/usr/local/cross/ia64/bin/ia64-pc-linux-gnu-ld -n --fatal-warnings -T arch/ia64/_link.ld -M -Map image.map -o image.raw kernel.co ns.co loader.co init.co locsrv.co rd.co vfs.co logger.co ext4fs.co initrd.co arch/ia64/src/boot.o arch/ia64/src/asm.o arch/ia64/src/main.o arch/ia64/src/sal.o arch/ia64/src/sal_asm.o arch/ia64/src/pal.o arch/ia64/src/pal_asm.o arch/ia64/src/putchar.o arch/ia64/src/_components.o genarch/src/efi.o genarch/src/division.o generic/src/balloc.o generic/src/memstr.o generic/src/printf_core.o generic/src/vprintf.o generic/src/printf.o generic/src/str.o generic/src/version.o generic/src/inflate.o arch/ia64/src/ski.o
/usr/local/cross/ia64/bin/ia64-pc-linux-gnu-objcopy -O elf64-ia64-little image.raw ../image.boot
[ -f Makefile.depend ] && cp -a Makefile.depend Makefile.depend.prev
make[2]: Leaving directory '/home/accounts/helenos-ci/nightly/tmp-ci/build/ia64-ski/helenos/boot'
make[1]: Leaving directory '/home/accounts/helenos-ci/nightly/tmp-ci/build/ia64-ski/helenos/boot'
mips32/malta-be OK HelenOS boot image View (tail) 3 min 18 s
/usr/local/cross/mips32eb/bin/mips-linux-gnu-gcc -DBOOT -DRELEASE=0.7.0 "-DCOPYRIGHT=Copyright (c) 2001-2017 HelenOS project" "-DNAME=Parabolic Potassium" -D__32_BITS__ -D__BE__ -Igeneric/include -I../abi/include -O3 -imacros ../config.h -fexec-charset=UTF-8 -fwide-exec-charset=UTF-32BE -finput-charset=UTF-8 -ffreestanding -fno-builtin -nostdlib -nostdinc -Wall -Wextra -Wno-unused-parameter -Wmissing-prototypes -std=gnu99 -Werror-implicit-function-declaration -Wwrite-strings -pipe -Werror -msoft-float -mno-abicalls -G 0 -fno-zero-initialized-in-bss -mabi=32 -march=4kc -c generic/src/printf.c -o generic/src/printf.o
/usr/local/cross/mips32eb/bin/mips-linux-gnu-gcc -DBOOT -DRELEASE=0.7.0 "-DCOPYRIGHT=Copyright (c) 2001-2017 HelenOS project" "-DNAME=Parabolic Potassium" -D__32_BITS__ -D__BE__ -Igeneric/include -I../abi/include -O3 -imacros ../config.h -fexec-charset=UTF-8 -fwide-exec-charset=UTF-32BE -finput-charset=UTF-8 -ffreestanding -fno-builtin -nostdlib -nostdinc -Wall -Wextra -Wno-unused-parameter -Wmissing-prototypes -std=gnu99 -Werror-implicit-function-declaration -Wwrite-strings -pipe -Werror -msoft-float -mno-abicalls -G 0 -fno-zero-initialized-in-bss -mabi=32 -march=4kc -c generic/src/str.c -o generic/src/str.o
/usr/local/cross/mips32eb/bin/mips-linux-gnu-gcc -DBOOT -DRELEASE=0.7.0 "-DCOPYRIGHT=Copyright (c) 2001-2017 HelenOS project" "-DNAME=Parabolic Potassium" -D__32_BITS__ -D__BE__ -Igeneric/include -I../abi/include -O3 -imacros ../config.h -fexec-charset=UTF-8 -fwide-exec-charset=UTF-32BE -finput-charset=UTF-8 -ffreestanding -fno-builtin -nostdlib -nostdinc -Wall -Wextra -Wno-unused-parameter -Wmissing-prototypes -std=gnu99 -Werror-implicit-function-declaration -Wwrite-strings -pipe -Werror -msoft-float -mno-abicalls -G 0 -fno-zero-initialized-in-bss -mabi=32 -march=4kc -c generic/src/version.c -o generic/src/version.o
/usr/local/cross/mips32eb/bin/mips-linux-gnu-gcc -DBOOT -DRELEASE=0.7.0 "-DCOPYRIGHT=Copyright (c) 2001-2017 HelenOS project" "-DNAME=Parabolic Potassium" -D__32_BITS__ -D__BE__ -Igeneric/include -I../abi/include -O3 -imacros ../config.h -fexec-charset=UTF-8 -fwide-exec-charset=UTF-32BE -finput-charset=UTF-8 -ffreestanding -fno-builtin -nostdlib -nostdinc -Wall -Wextra -Wno-unused-parameter -Wmissing-prototypes -std=gnu99 -Werror-implicit-function-declaration -Wwrite-strings -pipe -Werror -msoft-float -mno-abicalls -G 0 -fno-zero-initialized-in-bss -mabi=32 -march=4kc -c generic/src/inflate.c -o generic/src/inflate.o
/usr/local/cross/mips32eb/bin/mips-linux-gnu-gcc -DBOOT -DRELEASE=0.7.0 "-DCOPYRIGHT=Copyright (c) 2001-2017 HelenOS project" "-DNAME=Parabolic Potassium" -D__32_BITS__ -D__BE__ -Igeneric/include -I../abi/include -O3 -imacros ../config.h -fexec-charset=UTF-8 -fwide-exec-charset=UTF-32BE -finput-charset=UTF-8 -ffreestanding -fno-builtin -nostdlib -nostdinc -Wall -Wextra -Wno-unused-parameter -Wmissing-prototypes -std=gnu99 -Werror-implicit-function-declaration -Wwrite-strings -pipe -Werror -D__ASM__ -D__LINKER__ -E -x c arch/mips32/_link.ld.comp | grep -v "^\#" > arch/mips32/_link.ld
/usr/local/cross/mips32eb/bin/mips-linux-gnu-ld -n --fatal-warnings -T arch/mips32/_link.ld -M -Map image.map -o image.raw kernel.co ns.co loader.co init.co locsrv.co rd.co vfs.co logger.co ext4fs.co initrd.co arch/mips32/src/asm.o arch/mips32/src/main.o arch/mips32/src/putchar.o arch/mips32/src/_components.o genarch/src/division.o genarch/src/multiplication.o generic/src/memstr.o generic/src/printf_core.o generic/src/vprintf.o generic/src/printf.o generic/src/str.o generic/src/version.o generic/src/inflate.o
/usr/local/cross/mips32eb/bin/mips-linux-gnu-objcopy -O elf32-tradbigmips  image.raw ../image.boot
[ -f Makefile.depend ] && cp -a Makefile.depend Makefile.depend.prev
make[2]: Leaving directory '/home/accounts/helenos-ci/nightly/tmp-ci/build/mips32-malta-be/helenos/boot'
make[1]: Leaving directory '/home/accounts/helenos-ci/nightly/tmp-ci/build/mips32-malta-be/helenos/boot'
mips32/malta-le OK HelenOS boot image View (tail) 3 min 15 s
/usr/local/cross/mips32/bin/mipsel-linux-gnu-gcc -DBOOT -DRELEASE=0.7.0 "-DCOPYRIGHT=Copyright (c) 2001-2017 HelenOS project" "-DNAME=Parabolic Potassium" -D__32_BITS__ -D__LE__ -Igeneric/include -I../abi/include -O3 -imacros ../config.h -fexec-charset=UTF-8 -fwide-exec-charset=UTF-32LE -finput-charset=UTF-8 -ffreestanding -fno-builtin -nostdlib -nostdinc -Wall -Wextra -Wno-unused-parameter -Wmissing-prototypes -std=gnu99 -Werror-implicit-function-declaration -Wwrite-strings -pipe -Werror -msoft-float -mno-abicalls -G 0 -fno-zero-initialized-in-bss -mabi=32 -march=4kc -c generic/src/printf.c -o generic/src/printf.o
/usr/local/cross/mips32/bin/mipsel-linux-gnu-gcc -DBOOT -DRELEASE=0.7.0 "-DCOPYRIGHT=Copyright (c) 2001-2017 HelenOS project" "-DNAME=Parabolic Potassium" -D__32_BITS__ -D__LE__ -Igeneric/include -I../abi/include -O3 -imacros ../config.h -fexec-charset=UTF-8 -fwide-exec-charset=UTF-32LE -finput-charset=UTF-8 -ffreestanding -fno-builtin -nostdlib -nostdinc -Wall -Wextra -Wno-unused-parameter -Wmissing-prototypes -std=gnu99 -Werror-implicit-function-declaration -Wwrite-strings -pipe -Werror -msoft-float -mno-abicalls -G 0 -fno-zero-initialized-in-bss -mabi=32 -march=4kc -c generic/src/str.c -o generic/src/str.o
/usr/local/cross/mips32/bin/mipsel-linux-gnu-gcc -DBOOT -DRELEASE=0.7.0 "-DCOPYRIGHT=Copyright (c) 2001-2017 HelenOS project" "-DNAME=Parabolic Potassium" -D__32_BITS__ -D__LE__ -Igeneric/include -I../abi/include -O3 -imacros ../config.h -fexec-charset=UTF-8 -fwide-exec-charset=UTF-32LE -finput-charset=UTF-8 -ffreestanding -fno-builtin -nostdlib -nostdinc -Wall -Wextra -Wno-unused-parameter -Wmissing-prototypes -std=gnu99 -Werror-implicit-function-declaration -Wwrite-strings -pipe -Werror -msoft-float -mno-abicalls -G 0 -fno-zero-initialized-in-bss -mabi=32 -march=4kc -c generic/src/version.c -o generic/src/version.o
/usr/local/cross/mips32/bin/mipsel-linux-gnu-gcc -DBOOT -DRELEASE=0.7.0 "-DCOPYRIGHT=Copyright (c) 2001-2017 HelenOS project" "-DNAME=Parabolic Potassium" -D__32_BITS__ -D__LE__ -Igeneric/include -I../abi/include -O3 -imacros ../config.h -fexec-charset=UTF-8 -fwide-exec-charset=UTF-32LE -finput-charset=UTF-8 -ffreestanding -fno-builtin -nostdlib -nostdinc -Wall -Wextra -Wno-unused-parameter -Wmissing-prototypes -std=gnu99 -Werror-implicit-function-declaration -Wwrite-strings -pipe -Werror -msoft-float -mno-abicalls -G 0 -fno-zero-initialized-in-bss -mabi=32 -march=4kc -c generic/src/inflate.c -o generic/src/inflate.o
/usr/local/cross/mips32/bin/mipsel-linux-gnu-gcc -DBOOT -DRELEASE=0.7.0 "-DCOPYRIGHT=Copyright (c) 2001-2017 HelenOS project" "-DNAME=Parabolic Potassium" -D__32_BITS__ -D__LE__ -Igeneric/include -I../abi/include -O3 -imacros ../config.h -fexec-charset=UTF-8 -fwide-exec-charset=UTF-32LE -finput-charset=UTF-8 -ffreestanding -fno-builtin -nostdlib -nostdinc -Wall -Wextra -Wno-unused-parameter -Wmissing-prototypes -std=gnu99 -Werror-implicit-function-declaration -Wwrite-strings -pipe -Werror -D__ASM__ -D__LINKER__ -E -x c arch/mips32/_link.ld.comp | grep -v "^\#" > arch/mips32/_link.ld
/usr/local/cross/mips32/bin/mipsel-linux-gnu-ld -n --fatal-warnings -T arch/mips32/_link.ld -M -Map image.map -o image.raw kernel.co ns.co loader.co init.co locsrv.co rd.co vfs.co logger.co ext4fs.co initrd.co arch/mips32/src/asm.o arch/mips32/src/main.o arch/mips32/src/putchar.o arch/mips32/src/_components.o genarch/src/division.o genarch/src/multiplication.o generic/src/memstr.o generic/src/printf_core.o generic/src/vprintf.o generic/src/printf.o generic/src/str.o generic/src/version.o generic/src/inflate.o
/usr/local/cross/mips32/bin/mipsel-linux-gnu-objcopy -O elf32-tradlittlemips  image.raw ../image.boot
[ -f Makefile.depend ] && cp -a Makefile.depend Makefile.depend.prev
make[2]: Leaving directory '/home/accounts/helenos-ci/nightly/tmp-ci/build/mips32-malta-le/helenos/boot'
make[1]: Leaving directory '/home/accounts/helenos-ci/nightly/tmp-ci/build/mips32-malta-le/helenos/boot'
mips32/msim OK HelenOS boot image View (tail) 3 min 21 s
/usr/local/cross/mips32/bin/mipsel-linux-gnu-gcc -DBOOT -DRELEASE=0.7.0 "-DCOPYRIGHT=Copyright (c) 2001-2017 HelenOS project" "-DNAME=Parabolic Potassium" -D__32_BITS__ -D__LE__ -Igeneric/include -I../abi/include -O3 -imacros ../config.h -fexec-charset=UTF-8 -fwide-exec-charset=UTF-32LE -finput-charset=UTF-8 -ffreestanding -fno-builtin -nostdlib -nostdinc -Wall -Wextra -Wno-unused-parameter -Wmissing-prototypes -std=gnu99 -Werror-implicit-function-declaration -Wwrite-strings -pipe -Werror -msoft-float -mno-abicalls -G 0 -fno-zero-initialized-in-bss -mabi=32 -march=r4000 -c generic/src/printf.c -o generic/src/printf.o
/usr/local/cross/mips32/bin/mipsel-linux-gnu-gcc -DBOOT -DRELEASE=0.7.0 "-DCOPYRIGHT=Copyright (c) 2001-2017 HelenOS project" "-DNAME=Parabolic Potassium" -D__32_BITS__ -D__LE__ -Igeneric/include -I../abi/include -O3 -imacros ../config.h -fexec-charset=UTF-8 -fwide-exec-charset=UTF-32LE -finput-charset=UTF-8 -ffreestanding -fno-builtin -nostdlib -nostdinc -Wall -Wextra -Wno-unused-parameter -Wmissing-prototypes -std=gnu99 -Werror-implicit-function-declaration -Wwrite-strings -pipe -Werror -msoft-float -mno-abicalls -G 0 -fno-zero-initialized-in-bss -mabi=32 -march=r4000 -c generic/src/str.c -o generic/src/str.o
/usr/local/cross/mips32/bin/mipsel-linux-gnu-gcc -DBOOT -DRELEASE=0.7.0 "-DCOPYRIGHT=Copyright (c) 2001-2017 HelenOS project" "-DNAME=Parabolic Potassium" -D__32_BITS__ -D__LE__ -Igeneric/include -I../abi/include -O3 -imacros ../config.h -fexec-charset=UTF-8 -fwide-exec-charset=UTF-32LE -finput-charset=UTF-8 -ffreestanding -fno-builtin -nostdlib -nostdinc -Wall -Wextra -Wno-unused-parameter -Wmissing-prototypes -std=gnu99 -Werror-implicit-function-declaration -Wwrite-strings -pipe -Werror -msoft-float -mno-abicalls -G 0 -fno-zero-initialized-in-bss -mabi=32 -march=r4000 -c generic/src/version.c -o generic/src/version.o
/usr/local/cross/mips32/bin/mipsel-linux-gnu-gcc -DBOOT -DRELEASE=0.7.0 "-DCOPYRIGHT=Copyright (c) 2001-2017 HelenOS project" "-DNAME=Parabolic Potassium" -D__32_BITS__ -D__LE__ -Igeneric/include -I../abi/include -O3 -imacros ../config.h -fexec-charset=UTF-8 -fwide-exec-charset=UTF-32LE -finput-charset=UTF-8 -ffreestanding -fno-builtin -nostdlib -nostdinc -Wall -Wextra -Wno-unused-parameter -Wmissing-prototypes -std=gnu99 -Werror-implicit-function-declaration -Wwrite-strings -pipe -Werror -msoft-float -mno-abicalls -G 0 -fno-zero-initialized-in-bss -mabi=32 -march=r4000 -c generic/src/inflate.c -o generic/src/inflate.o
/usr/local/cross/mips32/bin/mipsel-linux-gnu-gcc -DBOOT -DRELEASE=0.7.0 "-DCOPYRIGHT=Copyright (c) 2001-2017 HelenOS project" "-DNAME=Parabolic Potassium" -D__32_BITS__ -D__LE__ -Igeneric/include -I../abi/include -O3 -imacros ../config.h -fexec-charset=UTF-8 -fwide-exec-charset=UTF-32LE -finput-charset=UTF-8 -ffreestanding -fno-builtin -nostdlib -nostdinc -Wall -Wextra -Wno-unused-parameter -Wmissing-prototypes -std=gnu99 -Werror-implicit-function-declaration -Wwrite-strings -pipe -Werror -D__ASM__ -D__LINKER__ -E -x c arch/mips32/_link.ld.comp | grep -v "^\#" > arch/mips32/_link.ld
/usr/local/cross/mips32/bin/mipsel-linux-gnu-ld -n --fatal-warnings -T arch/mips32/_link.ld -M -Map image.map -o image.raw kernel.co ns.co loader.co init.co locsrv.co rd.co vfs.co logger.co ext4fs.co initrd.co arch/mips32/src/asm.o arch/mips32/src/main.o arch/mips32/src/putchar.o arch/mips32/src/_components.o genarch/src/division.o genarch/src/multiplication.o generic/src/memstr.o generic/src/printf_core.o generic/src/vprintf.o generic/src/printf.o generic/src/str.o generic/src/version.o generic/src/inflate.o
/usr/local/cross/mips32/bin/mipsel-linux-gnu-objcopy -O binary image.raw ../image.boot
[ -f Makefile.depend ] && cp -a Makefile.depend Makefile.depend.prev
make[2]: Leaving directory '/home/accounts/helenos-ci/nightly/tmp-ci/build/mips32-msim/helenos/boot'
make[1]: Leaving directory '/home/accounts/helenos-ci/nightly/tmp-ci/build/mips32-msim/helenos/boot'
ppc32 OK HelenOS boot image View (tail) 2 min 58 s
Total extents actually written (inc HFS) = 4017
(Size of ISO volume = 3676, HFS extra = 341)
Total translation table size: 0
Total rockridge attributes bytes: 995
Total directory bytes: 4096
Path table size(bytes): 34
Max brk space used 0
4167 extents written (8 MB)
make[2]: Leaving directory '/home/accounts/helenos-ci/nightly/tmp-ci/build/ppc32/helenos/boot'
make[1]: Leaving directory '/home/accounts/helenos-ci/nightly/tmp-ci/build/ppc32/helenos/boot'
sparc64/niagara OK HelenOS boot image View (tail) 2 min 53 s
I: -input-charset not specified, using utf-8 (detected in locale settings)
Total translation table size: 0
Total rockridge attributes bytes: 914
Total directory bytes: 4096
Path table size(bytes): 38
Total extents including sparc boot = 960
Max brk space used 1a000
1110 extents written (2 MB)
make[2]: Leaving directory '/home/accounts/helenos-ci/nightly/tmp-ci/build/sparc64-niagara/helenos/boot'
make[1]: Leaving directory '/home/accounts/helenos-ci/nightly/tmp-ci/build/sparc64-niagara/helenos/boot'
sparc64/ultra OK HelenOS boot image View (tail) 3 min 7 s
I: -input-charset not specified, using utf-8 (detected in locale settings)
Total translation table size: 0
Total rockridge attributes bytes: 914
Total directory bytes: 4096
Path table size(bytes): 38
Total extents including sparc boot = 960
Max brk space used 1a000
1110 extents written (2 MB)
make[2]: Leaving directory '/home/accounts/helenos-ci/nightly/tmp-ci/build/sparc64-ultra/helenos/boot'
make[1]: Leaving directory '/home/accounts/helenos-ci/nightly/tmp-ci/build/sparc64-ultra/helenos/boot'
special/abs32le OK View (tail) 2 min 58 s
/usr/local/cross/ia32/bin/i686-pc-linux-gnu-ld -n --fatal-warnings -T ../../lib/c/arch/abs32le/_link.ld -M -Map test-libc.map -o test-libc test/main.test.o test/odict.test.o test/qsort.test.o test/sprintf.test.o test/str.test.o ../../lib/pcut/libpcut.a libc.a   ../../lib/c/libc.a ../../lib/softint/libsoftint.a
make[2]: Leaving directory '/home/accounts/helenos-ci/nightly/tmp-ci/build/special-abs32le/helenos/uspace/lib/c'
make[1]: Leaving directory '/home/accounts/helenos-ci/nightly/tmp-ci/build/special-abs32le/helenos/uspace'
make -r -C boot PRECHECK=
make[1]: Entering directory '/home/accounts/helenos-ci/nightly/tmp-ci/build/special-abs32le/helenos/boot'
make -r -f Makefile.empty PRECHECK=
make[2]: Entering directory '/home/accounts/helenos-ci/nightly/tmp-ci/build/special-abs32le/helenos/boot'
make[2]: Nothing to be done for 'all'.
make[2]: Leaving directory '/home/accounts/helenos-ci/nightly/tmp-ci/build/special-abs32le/helenos/boot'
make[1]: Leaving directory '/home/accounts/helenos-ci/nightly/tmp-ci/build/special-abs32le/helenos/boot'

Per-architecture details (back to top)

amd64(back to top)

Task Result Download Log Duration
HelenOS OK HelenOS boot image View (tail) 2 min 53 s
 40.27% done, estimate finish Tue Jun  6 01:49:19 2017
 80.41% done, estimate finish Tue Jun  6 01:49:19 2017
Total translation table size: 2048
Total rockridge attributes bytes: 25679
Total directory bytes: 43008
Path table size(bytes): 50
Max brk space used 44000
12437 extents written (24 MB)
make[2]: Leaving directory '/home/accounts/helenos-ci/nightly/tmp-ci/build/amd64/helenos/boot'
make[1]: Leaving directory '/home/accounts/helenos-ci/nightly/tmp-ci/build/amd64/helenos/boot'
base/fs.test OK View (tail) 5 min 55 s
   : echo 'screendump /home/accounts/helenos-ci/nightly/tmp-vm//main-full.ppm' | socat STDIN 'UNIX-CONNECT:/home/accounts/helenos-ci/nightly/tmp-vm//main.monitor'
   : xx_do_complex_text_waiting = 0
>> Forcefully killing machine main.
   : echo 'quit' | socat STDIN 'UNIX-CONNECT:/home/accounts/helenos-ci/nightly/tmp-vm//main.monitor'
# Scenario /home/accounts/helenos-ci/ci/scenarios/base/fs.test terminated, OK.

# Execution started on 2017-06-06 01:49.
# =======================================
/home/accounts/helenos-ci/ci/scenarios/base/fs.test    OK
# Execution finished on 2017-06-06 01:55.
base/tester_malloc1.test OK View (tail) 2 min 38 s
   : echo 'screendump /home/accounts/helenos-ci/nightly/tmp-vm//default-full.ppm' | socat STDIN 'UNIX-CONNECT:/home/accounts/helenos-ci/nightly/tmp-vm//default.monitor'
   : xx_do_complex_text_waiting = 0
>> Forcefully killing machine default.
   : echo 'quit' | socat STDIN 'UNIX-CONNECT:/home/accounts/helenos-ci/nightly/tmp-vm//default.monitor'
# Scenario /home/accounts/helenos-ci/ci/scenarios/base/tester_malloc1.test terminated, OK.

# Execution started on 2017-06-06 01:55.
# =======================================
/home/accounts/helenos-ci/ci/scenarios/base/tester_malloc1.test    OK
# Execution finished on 2017-06-06 01:57.
boot.test OK View (tail) 28 s
   : echo 'screendump /home/accounts/helenos-ci/nightly/tmp-vm//default-full.ppm' | socat STDIN 'UNIX-CONNECT:/home/accounts/helenos-ci/nightly/tmp-vm//default.monitor'
   : echo 'screendump /home/accounts/helenos-ci/nightly/tmp-vm//default-full.ppm' | socat STDIN 'UNIX-CONNECT:/home/accounts/helenos-ci/nightly/tmp-vm//default.monitor'
>> Forcefully killing machine default.
   : echo 'quit' | socat STDIN 'UNIX-CONNECT:/home/accounts/helenos-ci/nightly/tmp-vm//default.monitor'
# Scenario /home/accounts/helenos-ci/ci/scenarios/boot.test terminated, OK.

# Execution started on 2017-06-06 01:57.
# =======================================
/home/accounts/helenos-ci/ci/scenarios/boot.test    OK
# Execution finished on 2017-06-06 01:58.

arm32/beagleboardxm(back to top)

Task Result Download Log Duration
HelenOS OK HelenOS boot image View (tail) 3 min 23 s
/usr/local/cross/arm32/bin/arm-linux-gnueabi-ld -n --fatal-warnings -T arch/arm32/_link.ld -M -Map image.map -o image.raw kernel.co ns.co loader.co init.co locsrv.co rd.co vfs.co logger.co ext4fs.co initrd.co arch/arm32/src/asm.o arch/arm32/src/eabi.o arch/arm32/src/main.o arch/arm32/src/mm.o arch/arm32/src/putchar.o arch/arm32/src/_components.o genarch/src/division.o generic/src/memstr.o generic/src/printf_core.o generic/src/vprintf.o generic/src/printf.o generic/src/str.o generic/src/version.o generic/src/inflate.o
/usr/local/cross/arm32/bin/arm-linux-gnueabi-objcopy -O elf32-littlearm image.raw image.boot
[ -f Makefile.depend ] && cp -a Makefile.depend Makefile.depend.prev
make[2]: Leaving directory '/home/accounts/helenos-ci/nightly/tmp-ci/build/arm32-beagleboardxm/helenos/boot'
make -r -f Makefile.uboot PRECHECK=
make[2]: Entering directory '/home/accounts/helenos-ci/nightly/tmp-ci/build/arm32-beagleboardxm/helenos/boot'
/usr/local/cross/arm32/bin/arm-linux-gnueabi-objcopy -O binary image.boot image.bin
../tools/mkuimage.py -name "HelenOS-0.7.0" -laddr 0x80000000 -saddr 0x80000000 -ostype 2 image.bin ../uImage.bin
make[2]: Leaving directory '/home/accounts/helenos-ci/nightly/tmp-ci/build/arm32-beagleboardxm/helenos/boot'
make[1]: Leaving directory '/home/accounts/helenos-ci/nightly/tmp-ci/build/arm32-beagleboardxm/helenos/boot'

arm32/beaglebone(back to top)

Task Result Download Log Duration
HelenOS OK HelenOS boot image View (tail) 3 min 20 s
/usr/local/cross/arm32/bin/arm-linux-gnueabi-ld -n --fatal-warnings -T arch/arm32/_link.ld -M -Map image.map -o image.raw kernel.co ns.co loader.co init.co locsrv.co rd.co vfs.co logger.co ext4fs.co initrd.co arch/arm32/src/asm.o arch/arm32/src/eabi.o arch/arm32/src/main.o arch/arm32/src/mm.o arch/arm32/src/putchar.o arch/arm32/src/_components.o genarch/src/division.o generic/src/memstr.o generic/src/printf_core.o generic/src/vprintf.o generic/src/printf.o generic/src/str.o generic/src/version.o generic/src/inflate.o
/usr/local/cross/arm32/bin/arm-linux-gnueabi-objcopy -O elf32-littlearm image.raw image.boot
[ -f Makefile.depend ] && cp -a Makefile.depend Makefile.depend.prev
make[2]: Leaving directory '/home/accounts/helenos-ci/nightly/tmp-ci/build/arm32-beaglebone/helenos/boot'
make -r -f Makefile.uboot PRECHECK=
make[2]: Entering directory '/home/accounts/helenos-ci/nightly/tmp-ci/build/arm32-beaglebone/helenos/boot'
/usr/local/cross/arm32/bin/arm-linux-gnueabi-objcopy -O binary image.boot image.bin
../tools/mkuimage.py -name "HelenOS-0.7.0" -laddr 0x80000000 -saddr 0x80000000 -ostype 2 image.bin ../uImage.bin
make[2]: Leaving directory '/home/accounts/helenos-ci/nightly/tmp-ci/build/arm32-beaglebone/helenos/boot'
make[1]: Leaving directory '/home/accounts/helenos-ci/nightly/tmp-ci/build/arm32-beaglebone/helenos/boot'
msim Skipped View (tail)
Skipped: dependency coastline-prepare-for-arm32-beaglebone failed (or also skipped).
fdlibm Skipped View (tail)
Skipped: dependency coastline-prepare-for-arm32-beaglebone failed (or also skipped).
libiconv Skipped View (tail)
Skipped: dependency coastline-prepare-for-arm32-beaglebone failed (or also skipped).
pcc Skipped View (tail)
Skipped: dependency coastline-prepare-for-arm32-beaglebone failed (or also skipped).
jainja Skipped View (tail)
Skipped: dependency coastline-prepare-for-arm32-beaglebone failed (or also skipped).
zlib Skipped View (tail)
Skipped: dependency coastline-prepare-for-arm32-beaglebone failed (or also skipped).
libgmp Skipped View (tail)
Skipped: dependency coastline-prepare-for-arm32-beaglebone failed (or also skipped).
binutils Skipped View (tail)
Skipped: dependency coastline-prepare-for-arm32-beaglebone failed (or also skipped).
python2 Skipped View (tail)
Skipped: dependency coastline-build-fdlibm-for-arm32-beaglebone failed (or also skipped).
libpng Skipped View (tail)
Skipped: dependency coastline-build-zlib-for-arm32-beaglebone failed (or also skipped).
libisl Skipped View (tail)
Skipped: dependency coastline-build-libgmp-for-arm32-beaglebone failed (or also skipped).
libmpfr Skipped View (tail)
Skipped: dependency coastline-build-fdlibm-for-arm32-beaglebone failed (or also skipped).

arm32/gta02(back to top)

Task Result Download Log Duration
HelenOS OK HelenOS boot image View (tail) 3 min 25 s
/usr/local/cross/arm32/bin/arm-linux-gnueabi-ld -n --fatal-warnings -T arch/arm32/_link.ld -M -Map image.map -o image.raw kernel.co ns.co loader.co init.co locsrv.co rd.co vfs.co logger.co ext4fs.co initrd.co arch/arm32/src/asm.o arch/arm32/src/eabi.o arch/arm32/src/main.o arch/arm32/src/mm.o arch/arm32/src/putchar.o arch/arm32/src/_components.o genarch/src/division.o generic/src/memstr.o generic/src/printf_core.o generic/src/vprintf.o generic/src/printf.o generic/src/str.o generic/src/version.o generic/src/inflate.o
/usr/local/cross/arm32/bin/arm-linux-gnueabi-objcopy -O elf32-littlearm image.raw image.boot
[ -f Makefile.depend ] && cp -a Makefile.depend Makefile.depend.prev
make[2]: Leaving directory '/home/accounts/helenos-ci/nightly/tmp-ci/build/arm32-gta02/helenos/boot'
make -r -f Makefile.uboot PRECHECK=
make[2]: Entering directory '/home/accounts/helenos-ci/nightly/tmp-ci/build/arm32-gta02/helenos/boot'
/usr/local/cross/arm32/bin/arm-linux-gnueabi-objcopy -O binary image.boot image.bin
../tools/mkuimage.py -name "HelenOS-0.7.0" -laddr 0x30008000 -saddr 0x30008000 -ostype 5 image.bin ../uImage.bin
make[2]: Leaving directory '/home/accounts/helenos-ci/nightly/tmp-ci/build/arm32-gta02/helenos/boot'
make[1]: Leaving directory '/home/accounts/helenos-ci/nightly/tmp-ci/build/arm32-gta02/helenos/boot'

arm32/integratorcp(back to top)

Task Result Download Log Duration
HelenOS OK HelenOS boot image View (tail) 3 min 22 s
/usr/local/cross/arm32/bin/arm-linux-gnueabi-gcc -DBOOT -DRELEASE=0.7.0 "-DCOPYRIGHT=Copyright (c) 2001-2017 HelenOS project" "-DNAME=Parabolic Potassium" -D__32_BITS__ -D__LE__ -Igeneric/include -I../abi/include -O3 -imacros ../config.h -fexec-charset=UTF-8 -fwide-exec-charset=UTF-32LE -finput-charset=UTF-8 -ffreestanding -fno-builtin -nostdlib -nostdinc -Wall -Wextra -Wno-unused-parameter -Wmissing-prototypes -std=gnu99 -Werror-implicit-function-declaration -Wwrite-strings -pipe -Werror -march=armv5 -mno-unaligned-access -c generic/src/printf.c -o generic/src/printf.o
/usr/local/cross/arm32/bin/arm-linux-gnueabi-gcc -DBOOT -DRELEASE=0.7.0 "-DCOPYRIGHT=Copyright (c) 2001-2017 HelenOS project" "-DNAME=Parabolic Potassium" -D__32_BITS__ -D__LE__ -Igeneric/include -I../abi/include -O3 -imacros ../config.h -fexec-charset=UTF-8 -fwide-exec-charset=UTF-32LE -finput-charset=UTF-8 -ffreestanding -fno-builtin -nostdlib -nostdinc -Wall -Wextra -Wno-unused-parameter -Wmissing-prototypes -std=gnu99 -Werror-implicit-function-declaration -Wwrite-strings -pipe -Werror -march=armv5 -mno-unaligned-access -c generic/src/str.c -o generic/src/str.o
/usr/local/cross/arm32/bin/arm-linux-gnueabi-gcc -DBOOT -DRELEASE=0.7.0 "-DCOPYRIGHT=Copyright (c) 2001-2017 HelenOS project" "-DNAME=Parabolic Potassium" -D__32_BITS__ -D__LE__ -Igeneric/include -I../abi/include -O3 -imacros ../config.h -fexec-charset=UTF-8 -fwide-exec-charset=UTF-32LE -finput-charset=UTF-8 -ffreestanding -fno-builtin -nostdlib -nostdinc -Wall -Wextra -Wno-unused-parameter -Wmissing-prototypes -std=gnu99 -Werror-implicit-function-declaration -Wwrite-strings -pipe -Werror -march=armv5 -mno-unaligned-access -c generic/src/version.c -o generic/src/version.o
/usr/local/cross/arm32/bin/arm-linux-gnueabi-gcc -DBOOT -DRELEASE=0.7.0 "-DCOPYRIGHT=Copyright (c) 2001-2017 HelenOS project" "-DNAME=Parabolic Potassium" -D__32_BITS__ -D__LE__ -Igeneric/include -I../abi/include -O3 -imacros ../config.h -fexec-charset=UTF-8 -fwide-exec-charset=UTF-32LE -finput-charset=UTF-8 -ffreestanding -fno-builtin -nostdlib -nostdinc -Wall -Wextra -Wno-unused-parameter -Wmissing-prototypes -std=gnu99 -Werror-implicit-function-declaration -Wwrite-strings -pipe -Werror -march=armv5 -mno-unaligned-access -c generic/src/inflate.c -o generic/src/inflate.o
/usr/local/cross/arm32/bin/arm-linux-gnueabi-gcc -DBOOT -DRELEASE=0.7.0 "-DCOPYRIGHT=Copyright (c) 2001-2017 HelenOS project" "-DNAME=Parabolic Potassium" -D__32_BITS__ -D__LE__ -Igeneric/include -I../abi/include -O3 -imacros ../config.h -fexec-charset=UTF-8 -fwide-exec-charset=UTF-32LE -finput-charset=UTF-8 -ffreestanding -fno-builtin -nostdlib -nostdinc -Wall -Wextra -Wno-unused-parameter -Wmissing-prototypes -std=gnu99 -Werror-implicit-function-declaration -Wwrite-strings -pipe -Werror -D__ASM__ -D__LINKER__ -E -x c arch/arm32/_link.ld.comp | grep -v "^\#" > arch/arm32/_link.ld
/usr/local/cross/arm32/bin/arm-linux-gnueabi-ld -n --fatal-warnings -T arch/arm32/_link.ld -M -Map image.map -o image.raw kernel.co ns.co loader.co init.co locsrv.co rd.co vfs.co logger.co ext4fs.co initrd.co arch/arm32/src/asm.o arch/arm32/src/eabi.o arch/arm32/src/main.o arch/arm32/src/mm.o arch/arm32/src/putchar.o arch/arm32/src/_components.o genarch/src/division.o generic/src/memstr.o generic/src/printf_core.o generic/src/vprintf.o generic/src/printf.o generic/src/str.o generic/src/version.o generic/src/inflate.o
/usr/local/cross/arm32/bin/arm-linux-gnueabi-objcopy -O elf32-littlearm image.raw ../image.boot
[ -f Makefile.depend ] && cp -a Makefile.depend Makefile.depend.prev
make[2]: Leaving directory '/home/accounts/helenos-ci/nightly/tmp-ci/build/arm32-integratorcp/helenos/boot'
make[1]: Leaving directory '/home/accounts/helenos-ci/nightly/tmp-ci/build/arm32-integratorcp/helenos/boot'

arm32/raspberrypi(back to top)

Task Result Download Log Duration
HelenOS OK HelenOS boot image View (tail) 3 min 18 s
/usr/local/cross/arm32/bin/arm-linux-gnueabi-ld -n --fatal-warnings -T arch/arm32/_link.ld -M -Map image.map -o image.raw kernel.co ns.co loader.co init.co locsrv.co rd.co vfs.co logger.co fat.co initrd.co arch/arm32/src/asm.o arch/arm32/src/eabi.o arch/arm32/src/main.o arch/arm32/src/mm.o arch/arm32/src/putchar.o arch/arm32/src/_components.o genarch/src/division.o generic/src/memstr.o generic/src/printf_core.o generic/src/vprintf.o generic/src/printf.o generic/src/str.o generic/src/version.o generic/src/inflate.o
/usr/local/cross/arm32/bin/arm-linux-gnueabi-objcopy -O elf32-littlearm image.raw image.boot
[ -f Makefile.depend ] && cp -a Makefile.depend Makefile.depend.prev
make[2]: Leaving directory '/home/accounts/helenos-ci/nightly/tmp-ci/build/arm32-raspberrypi/helenos/boot'
make -r -f Makefile.uboot PRECHECK=
make[2]: Entering directory '/home/accounts/helenos-ci/nightly/tmp-ci/build/arm32-raspberrypi/helenos/boot'
/usr/local/cross/arm32/bin/arm-linux-gnueabi-objcopy -O binary image.boot image.bin
../tools/mkuimage.py -name "HelenOS-0.7.0" -laddr 0x00008000 -saddr 0x00008000 -ostype 5 image.bin ../uImage.bin
make[2]: Leaving directory '/home/accounts/helenos-ci/nightly/tmp-ci/build/arm32-raspberrypi/helenos/boot'
make[1]: Leaving directory '/home/accounts/helenos-ci/nightly/tmp-ci/build/arm32-raspberrypi/helenos/boot'

ia32(back to top)

Task Result Download Log Duration
HelenOS OK HelenOS boot image View (tail) 3 min 8 s
Size of boot image is 64 sectors -> No emulation
 80.58% done, estimate finish Tue Jun  6 01:34:18 2017
Total translation table size: 2048
Total rockridge attributes bytes: 25679
Total directory bytes: 43008
Path table size(bytes): 50
Max brk space used 44000
6220 extents written (12 MB)
make[2]: Leaving directory '/home/accounts/helenos-ci/nightly/tmp-ci/build/ia32/helenos/boot'
make[1]: Leaving directory '/home/accounts/helenos-ci/nightly/tmp-ci/build/ia32/helenos/boot'
msim Skipped View (tail)
Skipped: dependency coastline-prepare-for-ia32 failed (or also skipped).
fdlibm Skipped View (tail)
Skipped: dependency coastline-prepare-for-ia32 failed (or also skipped).
libiconv Skipped View (tail)
Skipped: dependency coastline-prepare-for-ia32 failed (or also skipped).
pcc Skipped View (tail)
Skipped: dependency coastline-prepare-for-ia32 failed (or also skipped).
jainja Skipped View (tail)
Skipped: dependency coastline-prepare-for-ia32 failed (or also skipped).
zlib Skipped View (tail)
Skipped: dependency coastline-prepare-for-ia32 failed (or also skipped).
libgmp Skipped View (tail)
Skipped: dependency coastline-prepare-for-ia32 failed (or also skipped).
binutils Skipped View (tail)
Skipped: dependency coastline-prepare-for-ia32 failed (or also skipped).
python2 Skipped View (tail)
Skipped: dependency coastline-build-fdlibm-for-ia32 failed (or also skipped).
libpng Skipped View (tail)
Skipped: dependency coastline-build-zlib-for-ia32 failed (or also skipped).
libisl Skipped View (tail)
Skipped: dependency coastline-build-libgmp-for-ia32 failed (or also skipped).
libmpfr Skipped View (tail)
Skipped: dependency coastline-build-fdlibm-for-ia32 failed (or also skipped).
libmpc Skipped View (tail)
Skipped: dependency coastline-build-libmpfr-for-ia32 failed (or also skipped).
gcc Skipped View (tail)
Skipped: dependency coastline-build-zlib-for-ia32 failed (or also skipped).
HelenOS with zlib Skipped View (tail)
Skipped: dependency coastline-build-zlib-for-ia32 failed (or also skipped).
HelenOS with gcc Skipped View (tail)
Skipped: dependency coastline-build-gcc-for-ia32 failed (or also skipped).
base/fs.test OK View (tail) 5 min 53 s
   : echo 'screendump /home/accounts/helenos-ci/nightly/tmp-vm//main-full.ppm' | socat STDIN 'UNIX-CONNECT:/home/accounts/helenos-ci/nightly/tmp-vm//main.monitor'
   : xx_do_complex_text_waiting = 0
>> Forcefully killing machine main.
   : echo 'quit' | socat STDIN 'UNIX-CONNECT:/home/accounts/helenos-ci/nightly/tmp-vm//main.monitor'
# Scenario /home/accounts/helenos-ci/ci/scenarios/base/fs.test terminated, OK.

# Execution started on 2017-06-06 01:34.
# =======================================
/home/accounts/helenos-ci/ci/scenarios/base/fs.test    OK
# Execution finished on 2017-06-06 01:40.
base/tester_malloc1.test OK View (tail) 2 min 16 s
   : echo 'screendump /home/accounts/helenos-ci/nightly/tmp-vm//default-full.ppm' | socat STDIN 'UNIX-CONNECT:/home/accounts/helenos-ci/nightly/tmp-vm//default.monitor'
   : xx_do_complex_text_waiting = 0
>> Forcefully killing machine default.
   : echo 'quit' | socat STDIN 'UNIX-CONNECT:/home/accounts/helenos-ci/nightly/tmp-vm//default.monitor'
# Scenario /home/accounts/helenos-ci/ci/scenarios/base/tester_malloc1.test terminated, OK.

# Execution started on 2017-06-06 01:40.
# =======================================
/home/accounts/helenos-ci/ci/scenarios/base/tester_malloc1.test    OK
# Execution finished on 2017-06-06 01:42.
boot.test OK View (tail) 39 s
   : echo 'screendump /home/accounts/helenos-ci/nightly/tmp-vm//default-full.ppm' | socat STDIN 'UNIX-CONNECT:/home/accounts/helenos-ci/nightly/tmp-vm//default.monitor'
   : echo 'screendump /home/accounts/helenos-ci/nightly/tmp-vm//default-full.ppm' | socat STDIN 'UNIX-CONNECT:/home/accounts/helenos-ci/nightly/tmp-vm//default.monitor'
>> Forcefully killing machine default.
   : echo 'quit' | socat STDIN 'UNIX-CONNECT:/home/accounts/helenos-ci/nightly/tmp-vm//default.monitor'
# Scenario /home/accounts/helenos-ci/ci/scenarios/boot.test terminated, OK.

# Execution started on 2017-06-06 01:42.
# =======================================
/home/accounts/helenos-ci/ci/scenarios/boot.test    OK
# Execution finished on 2017-06-06 01:43.
coast/zlib_minigzip.test Skipped View (tail)
Skipped: dependency extra-ia32-with-zlib failed (or also skipped).
coast/gcc_base.test Skipped View (tail)
Skipped: dependency extra-ia32-with-gcc failed (or also skipped).

ia64/i460GX(back to top)

Task Result Download Log Duration
HelenOS OK HelenOS boot image View (tail) 5 min 49 s
/usr/local/cross/ia64/bin/ia64-pc-linux-gnu-gcc -DBOOT -DRELEASE=0.7.0 "-DCOPYRIGHT=Copyright (c) 2001-2017 HelenOS project" "-DNAME=Parabolic Potassium" -D__64_BITS__ -D__LE__ -Igeneric/include -I../abi/include -O3 -imacros ../config.h -fexec-charset=UTF-8 -fwide-exec-charset=UTF-32LE -finput-charset=UTF-8 -ffreestanding -fno-builtin -nostdlib -nostdinc -Wall -Wextra -Wno-unused-parameter -Wmissing-prototypes -std=gnu99 -Werror-implicit-function-declaration -Wwrite-strings -pipe -Werror -fno-unwind-tables -mfixed-range=f32-f127 -mno-pic -mno-sdata -c generic/src/printf.c -o generic/src/printf.o
/usr/local/cross/ia64/bin/ia64-pc-linux-gnu-gcc -DBOOT -DRELEASE=0.7.0 "-DCOPYRIGHT=Copyright (c) 2001-2017 HelenOS project" "-DNAME=Parabolic Potassium" -D__64_BITS__ -D__LE__ -Igeneric/include -I../abi/include -O3 -imacros ../config.h -fexec-charset=UTF-8 -fwide-exec-charset=UTF-32LE -finput-charset=UTF-8 -ffreestanding -fno-builtin -nostdlib -nostdinc -Wall -Wextra -Wno-unused-parameter -Wmissing-prototypes -std=gnu99 -Werror-implicit-function-declaration -Wwrite-strings -pipe -Werror -fno-unwind-tables -mfixed-range=f32-f127 -mno-pic -mno-sdata -c generic/src/str.c -o generic/src/str.o
/usr/local/cross/ia64/bin/ia64-pc-linux-gnu-gcc -DBOOT -DRELEASE=0.7.0 "-DCOPYRIGHT=Copyright (c) 2001-2017 HelenOS project" "-DNAME=Parabolic Potassium" -D__64_BITS__ -D__LE__ -Igeneric/include -I../abi/include -O3 -imacros ../config.h -fexec-charset=UTF-8 -fwide-exec-charset=UTF-32LE -finput-charset=UTF-8 -ffreestanding -fno-builtin -nostdlib -nostdinc -Wall -Wextra -Wno-unused-parameter -Wmissing-prototypes -std=gnu99 -Werror-implicit-function-declaration -Wwrite-strings -pipe -Werror -fno-unwind-tables -mfixed-range=f32-f127 -mno-pic -mno-sdata -c generic/src/version.c -o generic/src/version.o
/usr/local/cross/ia64/bin/ia64-pc-linux-gnu-gcc -DBOOT -DRELEASE=0.7.0 "-DCOPYRIGHT=Copyright (c) 2001-2017 HelenOS project" "-DNAME=Parabolic Potassium" -D__64_BITS__ -D__LE__ -Igeneric/include -I../abi/include -O3 -imacros ../config.h -fexec-charset=UTF-8 -fwide-exec-charset=UTF-32LE -finput-charset=UTF-8 -ffreestanding -fno-builtin -nostdlib -nostdinc -Wall -Wextra -Wno-unused-parameter -Wmissing-prototypes -std=gnu99 -Werror-implicit-function-declaration -Wwrite-strings -pipe -Werror -fno-unwind-tables -mfixed-range=f32-f127 -mno-pic -mno-sdata -c generic/src/inflate.c -o generic/src/inflate.o
/usr/local/cross/ia64/bin/ia64-pc-linux-gnu-gcc -DBOOT -DRELEASE=0.7.0 "-DCOPYRIGHT=Copyright (c) 2001-2017 HelenOS project" "-DNAME=Parabolic Potassium" -D__64_BITS__ -D__LE__ -Igeneric/include -I../abi/include -O3 -imacros ../config.h -fexec-charset=UTF-8 -fwide-exec-charset=UTF-32LE -finput-charset=UTF-8 -ffreestanding -fno-builtin -nostdlib -nostdinc -Wall -Wextra -Wno-unused-parameter -Wmissing-prototypes -std=gnu99 -Werror-implicit-function-declaration -Wwrite-strings -pipe -Werror -D__ASM__ -D__LINKER__ -E -x c arch/ia64/_link.ld.comp | grep -v "^\#" > arch/ia64/_link.ld
/usr/local/cross/ia64/bin/ia64-pc-linux-gnu-ld -n --fatal-warnings -T arch/ia64/_link.ld -M -Map image.map -o image.raw kernel.co ns.co loader.co init.co locsrv.co rd.co vfs.co logger.co ext4fs.co initrd.co arch/ia64/src/boot.o arch/ia64/src/asm.o arch/ia64/src/main.o arch/ia64/src/sal.o arch/ia64/src/sal_asm.o arch/ia64/src/pal.o arch/ia64/src/pal_asm.o arch/ia64/src/putchar.o arch/ia64/src/_components.o genarch/src/efi.o genarch/src/division.o generic/src/balloc.o generic/src/memstr.o generic/src/printf_core.o generic/src/vprintf.o generic/src/printf.o generic/src/str.o generic/src/version.o generic/src/inflate.o
/usr/local/cross/ia64/bin/ia64-pc-linux-gnu-objcopy -O elf64-ia64-little image.raw ../image.boot
[ -f Makefile.depend ] && cp -a Makefile.depend Makefile.depend.prev
make[2]: Leaving directory '/home/accounts/helenos-ci/nightly/tmp-ci/build/ia64-i460GX/helenos/boot'
make[1]: Leaving directory '/home/accounts/helenos-ci/nightly/tmp-ci/build/ia64-i460GX/helenos/boot'
msim OK msim for ia64/i460GX View (tail) 7 s
/usr/local/cross/ia64/bin/ia64-pc-linux-gnu-gcc -O3 -imacros /home/accounts/helenos-ci/nightly/tmp-ci/build/ia64-i460GX/coast/helenos/include/system_config.h -fexec-charset=UTF-8 -fwide-exec-charset=UTF-32LE -finput-charset=UTF-8 -ffreestanding -fno-builtin -ffunction-sections -nostdlib -nostdinc -Wall -Wextra -Wno-clobbered -Wno-unused-parameter -Wmissing-prototypes -std=gnu99 -Wwrite-strings -pipe -ggdb -D__LE__ -fno-unwind-tables -I/home/accounts/helenos-ci/nightly/tmp-ci/build/ia64-i460GX/coast/helenos/include/posix -I/home/accounts/helenos-ci/nightly/tmp-ci/build/ia64-i460GX/coast/helenos/include/ -I/home/accounts/helenos-ci/nightly/tmp-ci/build/ia64-i460GX/coast/helenos/include/libc/ -Wno-error -c -o arch/win32/mmap.o arch/win32/mmap.c
/usr/local/cross/ia64/bin/ia64-pc-linux-gnu-gcc -O3 -imacros /home/accounts/helenos-ci/nightly/tmp-ci/build/ia64-i460GX/coast/helenos/include/system_config.h -fexec-charset=UTF-8 -fwide-exec-charset=UTF-32LE -finput-charset=UTF-8 -ffreestanding -fno-builtin -ffunction-sections -nostdlib -nostdinc -Wall -Wextra -Wno-clobbered -Wno-unused-parameter -Wmissing-prototypes -std=gnu99 -Wwrite-strings -pipe -ggdb -D__LE__ -fno-unwind-tables -I/home/accounts/helenos-ci/nightly/tmp-ci/build/ia64-i460GX/coast/helenos/include/posix -I/home/accounts/helenos-ci/nightly/tmp-ci/build/ia64-i460GX/coast/helenos/include/ -I/home/accounts/helenos-ci/nightly/tmp-ci/build/ia64-i460GX/coast/helenos/include/libc/ -Wno-error -c -o arch/win32/stdin.o arch/win32/stdin.c
/usr/local/cross/ia64/bin/ia64-pc-linux-gnu-gcc -O3 -imacros /home/accounts/helenos-ci/nightly/tmp-ci/build/ia64-i460GX/coast/helenos/include/system_config.h -fexec-charset=UTF-8 -fwide-exec-charset=UTF-32LE -finput-charset=UTF-8 -ffreestanding -fno-builtin -ffunction-sections -nostdlib -nostdinc -Wall -Wextra -Wno-clobbered -Wno-unused-parameter -Wmissing-prototypes -std=gnu99 -Wwrite-strings -pipe -ggdb -D__LE__ -fno-unwind-tables -I/home/accounts/helenos-ci/nightly/tmp-ci/build/ia64-i460GX/coast/helenos/include/posix -I/home/accounts/helenos-ci/nightly/tmp-ci/build/ia64-i460GX/coast/helenos/include/ -I/home/accounts/helenos-ci/nightly/tmp-ci/build/ia64-i460GX/coast/helenos/include/libc/ -Wno-error -c -o arch/win32/signal.o arch/win32/signal.c
/usr/local/cross/ia64/bin/ia64-pc-linux-gnu-gcc -O3 -imacros /home/accounts/helenos-ci/nightly/tmp-ci/build/ia64-i460GX/coast/helenos/include/system_config.h -fexec-charset=UTF-8 -fwide-exec-charset=UTF-32LE -finput-charset=UTF-8 -ffreestanding -fno-builtin -ffunction-sections -nostdlib -nostdinc -Wall -Wextra -Wno-clobbered -Wno-unused-parameter -Wmissing-prototypes -std=gnu99 -Wwrite-strings -pipe -ggdb -D__LE__ -fno-unwind-tables -I/home/accounts/helenos-ci/nightly/tmp-ci/build/ia64-i460GX/coast/helenos/include/posix -I/home/accounts/helenos-ci/nightly/tmp-ci/build/ia64-i460GX/coast/helenos/include/ -I/home/accounts/helenos-ci/nightly/tmp-ci/build/ia64-i460GX/coast/helenos/include/libc/ -Wno-error -c -o arch/posix/signal.o arch/posix/signal.c
/usr/local/cross/ia64/bin/ia64-pc-linux-gnu-ld -o msim utils.o fault.o text.o env.o cline.o cmd.o check.o main.o parser.o list.o arch/helenos/input.o arch/helenos/misc.o io/output.o cpu/cpu.o cpu/instr.o debug/debug.o debug/breakpoint.o device/machine.o device/mem.o device/ddisk.o device/dcpu.o device/dkeyboard.o device/dorder.o device/dprinter.o device/dtime.o device/device.o arch/win32/mmap.o arch/win32/stdin.o arch/win32/signal.o arch/posix/signal.o -lclui -L/home/accounts/helenos-ci/nightly/tmp-ci/build/ia64-i460GX/coast/helenos/lib/other --fatal-warnings -L/home/accounts/helenos-ci/nightly/tmp-ci/build/ia64-i460GX/coast/helenos/lib -n -T /home/accounts/helenos-ci/nightly/tmp-ci/build/ia64-i460GX/coast/helenos/link.ld --whole-archive --start-group -lposixaslibc -lsoftint  --end-group --no-whole-archive -lc4posix
make: Leaving directory '/home/accounts/helenos-ci/nightly/tmp-ci/build/ia64-i460GX/coast/build/msim/msim-1.3.8.1/src'
>>> Packaging...
[hsct]: "mkdir" "-p" "/home/accounts/helenos-ci/nightly/tmp-ci/build/ia64-i460GX/coast/dist//msim/app/" 
[hsct]: "cp" "src/msim" "/home/accounts/helenos-ci/nightly/tmp-ci/build/ia64-i460GX/coast/dist//msim/app/" 
>>> Creating the tarball...
fdlibm Failed View (tail) 7 s
  ^~
/usr/local/cross/ia64/bin/ia64-pc-linux-gnu-ar cru libfdm.a k_standard.o k_rem_pio2.o k_cos.o k_sin.o k_tan.o e_acos.o e_acosh.o e_asin.o e_atan2.o e_atanh.o e_cosh.o e_exp.o e_fmod.o e_gamma.o e_gamma_r.o e_hypot.o e_j0.o e_j1.o e_jn.o e_lgamma.o e_lgamma_r.o e_log.o e_log10.o e_pow.o e_rem_pio2.o e_remainder.o e_scalb.o e_sinh.o e_sqrt.o w_acos.o w_acosh.o w_asin.o w_atan2.o w_atanh.o w_cosh.o w_exp.o w_fmod.o w_gamma.o w_gamma_r.o w_hypot.o w_j0.o w_j1.o w_jn.o w_lgamma.o w_lgamma_r.o w_log.o w_log10.o w_pow.o w_remainder.o w_scalb.o w_sinh.o w_sqrt.o s_asinh.o s_atan.o s_cbrt.o s_ceil.o s_copysign.o s_cos.o s_erf.o s_expm1.o s_fabs.o s_finite.o s_floor.o s_frexp.o s_ilogb.o s_isnan.o s_ldexp.o s_lib_version.o s_log1p.o s_logb.o s_matherr.o s_modf.o s_nextafter.o s_rint.o s_scalbn.o s_signgam.o s_significand.o s_sin.o s_tan.o s_tanh.o
/usr/local/cross/ia64/bin/ia64-pc-linux-gnu-ranlib libfdm.a || true
>>> Packaging...
[hsct]: "cp" "fdlibm53/libfdm.a" "/home/accounts/helenos-ci/nightly/tmp-ci/build/ia64-i460GX/coast/libs/" 
[hsct]: "mkdir" "-p" "/home/accounts/helenos-ci/nightly/tmp-ci/build/ia64-i460GX/coast/dist//fdlibm/lib" 
[hsct]: "cp" "fdlibm53/libfdm.a" "/home/accounts/helenos-ci/nightly/tmp-ci/build/ia64-i460GX/coast/dist//fdlibm/lib/" 
>>> Creating the tarball...
xz: (stdin): Cannot allocate memory
[hsct]: Error: Archiving failed!
libiconv Failed View (tail) 4 s
checking if /usr/local/cross/ia64/bin/ia64-pc-linux-gnu-gcc supports -c -o file.o... (cached) no
checking if we can lock with hard links... yes
checking whether the /usr/local/cross/ia64/bin/ia64-pc-linux-gnu-gcc linker (/usr/local/cross/ia64/bin/ia64-pc-linux-gnu-ld) supports shared libraries... yes
checking dynamic linker characteristics... ./configure: fork: Cannot allocate memory
./configure: fork: Cannot allocate memory
[hsct]: "sed" "s#cp .libs/libiconv.so preloadable_libiconv.so#touch preloadable_libiconv.so#" "-i" "preload/Makefile" 
sed: can't read preload/Makefile: No such file or directory
[hsct]: "make" "STATIC_ONLY=y" 
make: *** No targets specified and no makefile found.  Stop.
[hsct]: Error: Build failed!
pcc Failed View 0 s
jainja Failed View 0 s
zlib Failed View 0 s
libgmp Failed View 0 s
binutils Failed View 0 s
python2 Skipped View (tail)
Skipped: dependency coastline-build-fdlibm-for-ia64-i460GX failed (or also skipped).
libpng Skipped View (tail)
Skipped: dependency coastline-build-zlib-for-ia64-i460GX failed (or also skipped).
libisl Skipped View (tail)
Skipped: dependency coastline-build-libgmp-for-ia64-i460GX failed (or also skipped).
libmpfr Skipped View (tail)
Skipped: dependency coastline-build-fdlibm-for-ia64-i460GX failed (or also skipped).
libmpc Skipped View (tail)
Skipped: dependency coastline-build-libmpfr-for-ia64-i460GX failed (or also skipped).
gcc Skipped View (tail)
Skipped: dependency coastline-build-zlib-for-ia64-i460GX failed (or also skipped).

ia64/ski(back to top)

Task Result Download Log Duration
HelenOS OK HelenOS boot image View (tail) 6 min 1 s
/usr/local/cross/ia64/bin/ia64-pc-linux-gnu-gcc -DBOOT -DRELEASE=0.7.0 "-DCOPYRIGHT=Copyright (c) 2001-2017 HelenOS project" "-DNAME=Parabolic Potassium" -D__64_BITS__ -D__LE__ -Igeneric/include -I../abi/include -O3 -imacros ../config.h -fexec-charset=UTF-8 -fwide-exec-charset=UTF-32LE -finput-charset=UTF-8 -ffreestanding -fno-builtin -nostdlib -nostdinc -Wall -Wextra -Wno-unused-parameter -Wmissing-prototypes -std=gnu99 -Werror-implicit-function-declaration -Wwrite-strings -pipe -Werror -fno-unwind-tables -mfixed-range=f32-f127 -mno-pic -mno-sdata -c generic/src/str.c -o generic/src/str.o
/usr/local/cross/ia64/bin/ia64-pc-linux-gnu-gcc -DBOOT -DRELEASE=0.7.0 "-DCOPYRIGHT=Copyright (c) 2001-2017 HelenOS project" "-DNAME=Parabolic Potassium" -D__64_BITS__ -D__LE__ -Igeneric/include -I../abi/include -O3 -imacros ../config.h -fexec-charset=UTF-8 -fwide-exec-charset=UTF-32LE -finput-charset=UTF-8 -ffreestanding -fno-builtin -nostdlib -nostdinc -Wall -Wextra -Wno-unused-parameter -Wmissing-prototypes -std=gnu99 -Werror-implicit-function-declaration -Wwrite-strings -pipe -Werror -fno-unwind-tables -mfixed-range=f32-f127 -mno-pic -mno-sdata -c generic/src/version.c -o generic/src/version.o
/usr/local/cross/ia64/bin/ia64-pc-linux-gnu-gcc -DBOOT -DRELEASE=0.7.0 "-DCOPYRIGHT=Copyright (c) 2001-2017 HelenOS project" "-DNAME=Parabolic Potassium" -D__64_BITS__ -D__LE__ -Igeneric/include -I../abi/include -O3 -imacros ../config.h -fexec-charset=UTF-8 -fwide-exec-charset=UTF-32LE -finput-charset=UTF-8 -ffreestanding -fno-builtin -nostdlib -nostdinc -Wall -Wextra -Wno-unused-parameter -Wmissing-prototypes -std=gnu99 -Werror-implicit-function-declaration -Wwrite-strings -pipe -Werror -fno-unwind-tables -mfixed-range=f32-f127 -mno-pic -mno-sdata -c generic/src/inflate.c -o generic/src/inflate.o
/usr/local/cross/ia64/bin/ia64-pc-linux-gnu-gcc -DBOOT -DRELEASE=0.7.0 "-DCOPYRIGHT=Copyright (c) 2001-2017 HelenOS project" "-DNAME=Parabolic Potassium" -D__64_BITS__ -D__LE__ -Igeneric/include -I../abi/include -O3 -imacros ../config.h -fexec-charset=UTF-8 -fwide-exec-charset=UTF-32LE -finput-charset=UTF-8 -ffreestanding -fno-builtin -nostdlib -nostdinc -Wall -Wextra -Wno-unused-parameter -Wmissing-prototypes -std=gnu99 -Werror-implicit-function-declaration -Wwrite-strings -pipe -Werror -fno-unwind-tables -mfixed-range=f32-f127 -mno-pic -mno-sdata -c arch/ia64/src/ski.c -o arch/ia64/src/ski.o
/usr/local/cross/ia64/bin/ia64-pc-linux-gnu-gcc -DBOOT -DRELEASE=0.7.0 "-DCOPYRIGHT=Copyright (c) 2001-2017 HelenOS project" "-DNAME=Parabolic Potassium" -D__64_BITS__ -D__LE__ -Igeneric/include -I../abi/include -O3 -imacros ../config.h -fexec-charset=UTF-8 -fwide-exec-charset=UTF-32LE -finput-charset=UTF-8 -ffreestanding -fno-builtin -nostdlib -nostdinc -Wall -Wextra -Wno-unused-parameter -Wmissing-prototypes -std=gnu99 -Werror-implicit-function-declaration -Wwrite-strings -pipe -Werror -D__ASM__ -D__LINKER__ -E -x c arch/ia64/_link.ld.comp | grep -v "^\#" > arch/ia64/_link.ld
/usr/local/cross/ia64/bin/ia64-pc-linux-gnu-ld -n --fatal-warnings -T arch/ia64/_link.ld -M -Map image.map -o image.raw kernel.co ns.co loader.co init.co locsrv.co rd.co vfs.co logger.co ext4fs.co initrd.co arch/ia64/src/boot.o arch/ia64/src/asm.o arch/ia64/src/main.o arch/ia64/src/sal.o arch/ia64/src/sal_asm.o arch/ia64/src/pal.o arch/ia64/src/pal_asm.o arch/ia64/src/putchar.o arch/ia64/src/_components.o genarch/src/efi.o genarch/src/division.o generic/src/balloc.o generic/src/memstr.o generic/src/printf_core.o generic/src/vprintf.o generic/src/printf.o generic/src/str.o generic/src/version.o generic/src/inflate.o arch/ia64/src/ski.o
/usr/local/cross/ia64/bin/ia64-pc-linux-gnu-objcopy -O elf64-ia64-little image.raw ../image.boot
[ -f Makefile.depend ] && cp -a Makefile.depend Makefile.depend.prev
make[2]: Leaving directory '/home/accounts/helenos-ci/nightly/tmp-ci/build/ia64-ski/helenos/boot'
make[1]: Leaving directory '/home/accounts/helenos-ci/nightly/tmp-ci/build/ia64-ski/helenos/boot'

mips32/malta-be(back to top)

Task Result Download Log Duration
HelenOS OK HelenOS boot image View (tail) 3 min 18 s
/usr/local/cross/mips32eb/bin/mips-linux-gnu-gcc -DBOOT -DRELEASE=0.7.0 "-DCOPYRIGHT=Copyright (c) 2001-2017 HelenOS project" "-DNAME=Parabolic Potassium" -D__32_BITS__ -D__BE__ -Igeneric/include -I../abi/include -O3 -imacros ../config.h -fexec-charset=UTF-8 -fwide-exec-charset=UTF-32BE -finput-charset=UTF-8 -ffreestanding -fno-builtin -nostdlib -nostdinc -Wall -Wextra -Wno-unused-parameter -Wmissing-prototypes -std=gnu99 -Werror-implicit-function-declaration -Wwrite-strings -pipe -Werror -msoft-float -mno-abicalls -G 0 -fno-zero-initialized-in-bss -mabi=32 -march=4kc -c generic/src/printf.c -o generic/src/printf.o
/usr/local/cross/mips32eb/bin/mips-linux-gnu-gcc -DBOOT -DRELEASE=0.7.0 "-DCOPYRIGHT=Copyright (c) 2001-2017 HelenOS project" "-DNAME=Parabolic Potassium" -D__32_BITS__ -D__BE__ -Igeneric/include -I../abi/include -O3 -imacros ../config.h -fexec-charset=UTF-8 -fwide-exec-charset=UTF-32BE -finput-charset=UTF-8 -ffreestanding -fno-builtin -nostdlib -nostdinc -Wall -Wextra -Wno-unused-parameter -Wmissing-prototypes -std=gnu99 -Werror-implicit-function-declaration -Wwrite-strings -pipe -Werror -msoft-float -mno-abicalls -G 0 -fno-zero-initialized-in-bss -mabi=32 -march=4kc -c generic/src/str.c -o generic/src/str.o
/usr/local/cross/mips32eb/bin/mips-linux-gnu-gcc -DBOOT -DRELEASE=0.7.0 "-DCOPYRIGHT=Copyright (c) 2001-2017 HelenOS project" "-DNAME=Parabolic Potassium" -D__32_BITS__ -D__BE__ -Igeneric/include -I../abi/include -O3 -imacros ../config.h -fexec-charset=UTF-8 -fwide-exec-charset=UTF-32BE -finput-charset=UTF-8 -ffreestanding -fno-builtin -nostdlib -nostdinc -Wall -Wextra -Wno-unused-parameter -Wmissing-prototypes -std=gnu99 -Werror-implicit-function-declaration -Wwrite-strings -pipe -Werror -msoft-float -mno-abicalls -G 0 -fno-zero-initialized-in-bss -mabi=32 -march=4kc -c generic/src/version.c -o generic/src/version.o
/usr/local/cross/mips32eb/bin/mips-linux-gnu-gcc -DBOOT -DRELEASE=0.7.0 "-DCOPYRIGHT=Copyright (c) 2001-2017 HelenOS project" "-DNAME=Parabolic Potassium" -D__32_BITS__ -D__BE__ -Igeneric/include -I../abi/include -O3 -imacros ../config.h -fexec-charset=UTF-8 -fwide-exec-charset=UTF-32BE -finput-charset=UTF-8 -ffreestanding -fno-builtin -nostdlib -nostdinc -Wall -Wextra -Wno-unused-parameter -Wmissing-prototypes -std=gnu99 -Werror-implicit-function-declaration -Wwrite-strings -pipe -Werror -msoft-float -mno-abicalls -G 0 -fno-zero-initialized-in-bss -mabi=32 -march=4kc -c generic/src/inflate.c -o generic/src/inflate.o
/usr/local/cross/mips32eb/bin/mips-linux-gnu-gcc -DBOOT -DRELEASE=0.7.0 "-DCOPYRIGHT=Copyright (c) 2001-2017 HelenOS project" "-DNAME=Parabolic Potassium" -D__32_BITS__ -D__BE__ -Igeneric/include -I../abi/include -O3 -imacros ../config.h -fexec-charset=UTF-8 -fwide-exec-charset=UTF-32BE -finput-charset=UTF-8 -ffreestanding -fno-builtin -nostdlib -nostdinc -Wall -Wextra -Wno-unused-parameter -Wmissing-prototypes -std=gnu99 -Werror-implicit-function-declaration -Wwrite-strings -pipe -Werror -D__ASM__ -D__LINKER__ -E -x c arch/mips32/_link.ld.comp | grep -v "^\#" > arch/mips32/_link.ld
/usr/local/cross/mips32eb/bin/mips-linux-gnu-ld -n --fatal-warnings -T arch/mips32/_link.ld -M -Map image.map -o image.raw kernel.co ns.co loader.co init.co locsrv.co rd.co vfs.co logger.co ext4fs.co initrd.co arch/mips32/src/asm.o arch/mips32/src/main.o arch/mips32/src/putchar.o arch/mips32/src/_components.o genarch/src/division.o genarch/src/multiplication.o generic/src/memstr.o generic/src/printf_core.o generic/src/vprintf.o generic/src/printf.o generic/src/str.o generic/src/version.o generic/src/inflate.o
/usr/local/cross/mips32eb/bin/mips-linux-gnu-objcopy -O elf32-tradbigmips  image.raw ../image.boot
[ -f Makefile.depend ] && cp -a Makefile.depend Makefile.depend.prev
make[2]: Leaving directory '/home/accounts/helenos-ci/nightly/tmp-ci/build/mips32-malta-be/helenos/boot'
make[1]: Leaving directory '/home/accounts/helenos-ci/nightly/tmp-ci/build/mips32-malta-be/helenos/boot'
msim Skipped View (tail)
Skipped: dependency coastline-prepare-for-mips32-malta-be failed (or also skipped).
fdlibm Skipped View (tail)
Skipped: dependency coastline-prepare-for-mips32-malta-be failed (or also skipped).
libiconv Skipped View (tail)
Skipped: dependency coastline-prepare-for-mips32-malta-be failed (or also skipped).
pcc Skipped View (tail)
Skipped: dependency coastline-prepare-for-mips32-malta-be failed (or also skipped).
jainja Skipped View (tail)
Skipped: dependency coastline-prepare-for-mips32-malta-be failed (or also skipped).
zlib Skipped View (tail)
Skipped: dependency coastline-prepare-for-mips32-malta-be failed (or also skipped).
libgmp Skipped View (tail)
Skipped: dependency coastline-prepare-for-mips32-malta-be failed (or also skipped).
binutils Skipped View (tail)
Skipped: dependency coastline-prepare-for-mips32-malta-be failed (or also skipped).
python2 Skipped View (tail)
Skipped: dependency coastline-build-fdlibm-for-mips32-malta-be failed (or also skipped).
libpng Skipped View (tail)
Skipped: dependency coastline-build-zlib-for-mips32-malta-be failed (or also skipped).
libisl Skipped View (tail)
Skipped: dependency coastline-build-libgmp-for-mips32-malta-be failed (or also skipped).
libmpfr Skipped View (tail)
Skipped: dependency coastline-build-fdlibm-for-mips32-malta-be failed (or also skipped).
libmpc Skipped View (tail)
Skipped: dependency coastline-build-libmpfr-for-mips32-malta-be failed (or also skipped).
gcc Skipped View (tail)
Skipped: dependency coastline-build-zlib-for-mips32-malta-be failed (or also skipped).

mips32/malta-le(back to top)

Task Result Download Log Duration
HelenOS OK HelenOS boot image View (tail) 3 min 15 s
/usr/local/cross/mips32/bin/mipsel-linux-gnu-gcc -DBOOT -DRELEASE=0.7.0 "-DCOPYRIGHT=Copyright (c) 2001-2017 HelenOS project" "-DNAME=Parabolic Potassium" -D__32_BITS__ -D__LE__ -Igeneric/include -I../abi/include -O3 -imacros ../config.h -fexec-charset=UTF-8 -fwide-exec-charset=UTF-32LE -finput-charset=UTF-8 -ffreestanding -fno-builtin -nostdlib -nostdinc -Wall -Wextra -Wno-unused-parameter -Wmissing-prototypes -std=gnu99 -Werror-implicit-function-declaration -Wwrite-strings -pipe -Werror -msoft-float -mno-abicalls -G 0 -fno-zero-initialized-in-bss -mabi=32 -march=4kc -c generic/src/printf.c -o generic/src/printf.o
/usr/local/cross/mips32/bin/mipsel-linux-gnu-gcc -DBOOT -DRELEASE=0.7.0 "-DCOPYRIGHT=Copyright (c) 2001-2017 HelenOS project" "-DNAME=Parabolic Potassium" -D__32_BITS__ -D__LE__ -Igeneric/include -I../abi/include -O3 -imacros ../config.h -fexec-charset=UTF-8 -fwide-exec-charset=UTF-32LE -finput-charset=UTF-8 -ffreestanding -fno-builtin -nostdlib -nostdinc -Wall -Wextra -Wno-unused-parameter -Wmissing-prototypes -std=gnu99 -Werror-implicit-function-declaration -Wwrite-strings -pipe -Werror -msoft-float -mno-abicalls -G 0 -fno-zero-initialized-in-bss -mabi=32 -march=4kc -c generic/src/str.c -o generic/src/str.o
/usr/local/cross/mips32/bin/mipsel-linux-gnu-gcc -DBOOT -DRELEASE=0.7.0 "-DCOPYRIGHT=Copyright (c) 2001-2017 HelenOS project" "-DNAME=Parabolic Potassium" -D__32_BITS__ -D__LE__ -Igeneric/include -I../abi/include -O3 -imacros ../config.h -fexec-charset=UTF-8 -fwide-exec-charset=UTF-32LE -finput-charset=UTF-8 -ffreestanding -fno-builtin -nostdlib -nostdinc -Wall -Wextra -Wno-unused-parameter -Wmissing-prototypes -std=gnu99 -Werror-implicit-function-declaration -Wwrite-strings -pipe -Werror -msoft-float -mno-abicalls -G 0 -fno-zero-initialized-in-bss -mabi=32 -march=4kc -c generic/src/version.c -o generic/src/version.o
/usr/local/cross/mips32/bin/mipsel-linux-gnu-gcc -DBOOT -DRELEASE=0.7.0 "-DCOPYRIGHT=Copyright (c) 2001-2017 HelenOS project" "-DNAME=Parabolic Potassium" -D__32_BITS__ -D__LE__ -Igeneric/include -I../abi/include -O3 -imacros ../config.h -fexec-charset=UTF-8 -fwide-exec-charset=UTF-32LE -finput-charset=UTF-8 -ffreestanding -fno-builtin -nostdlib -nostdinc -Wall -Wextra -Wno-unused-parameter -Wmissing-prototypes -std=gnu99 -Werror-implicit-function-declaration -Wwrite-strings -pipe -Werror -msoft-float -mno-abicalls -G 0 -fno-zero-initialized-in-bss -mabi=32 -march=4kc -c generic/src/inflate.c -o generic/src/inflate.o
/usr/local/cross/mips32/bin/mipsel-linux-gnu-gcc -DBOOT -DRELEASE=0.7.0 "-DCOPYRIGHT=Copyright (c) 2001-2017 HelenOS project" "-DNAME=Parabolic Potassium" -D__32_BITS__ -D__LE__ -Igeneric/include -I../abi/include -O3 -imacros ../config.h -fexec-charset=UTF-8 -fwide-exec-charset=UTF-32LE -finput-charset=UTF-8 -ffreestanding -fno-builtin -nostdlib -nostdinc -Wall -Wextra -Wno-unused-parameter -Wmissing-prototypes -std=gnu99 -Werror-implicit-function-declaration -Wwrite-strings -pipe -Werror -D__ASM__ -D__LINKER__ -E -x c arch/mips32/_link.ld.comp | grep -v "^\#" > arch/mips32/_link.ld
/usr/local/cross/mips32/bin/mipsel-linux-gnu-ld -n --fatal-warnings -T arch/mips32/_link.ld -M -Map image.map -o image.raw kernel.co ns.co loader.co init.co locsrv.co rd.co vfs.co logger.co ext4fs.co initrd.co arch/mips32/src/asm.o arch/mips32/src/main.o arch/mips32/src/putchar.o arch/mips32/src/_components.o genarch/src/division.o genarch/src/multiplication.o generic/src/memstr.o generic/src/printf_core.o generic/src/vprintf.o generic/src/printf.o generic/src/str.o generic/src/version.o generic/src/inflate.o
/usr/local/cross/mips32/bin/mipsel-linux-gnu-objcopy -O elf32-tradlittlemips  image.raw ../image.boot
[ -f Makefile.depend ] && cp -a Makefile.depend Makefile.depend.prev
make[2]: Leaving directory '/home/accounts/helenos-ci/nightly/tmp-ci/build/mips32-malta-le/helenos/boot'
make[1]: Leaving directory '/home/accounts/helenos-ci/nightly/tmp-ci/build/mips32-malta-le/helenos/boot'
msim OK msim for mips32/malta-le View (tail) 5 s
/usr/local/cross/mips32/bin/mipsel-linux-gnu-gcc -O3 -imacros /home/accounts/helenos-ci/nightly/tmp-ci/build/mips32-malta-le/coast/helenos/include/system_config.h -fexec-charset=UTF-8 -fwide-exec-charset=UTF-32LE -finput-charset=UTF-8 -ffreestanding -fno-builtin -ffunction-sections -nostdlib -nostdinc -Wall -Wextra -Wno-clobbered -Wno-unused-parameter -Wmissing-prototypes -std=gnu99 -Wwrite-strings -pipe -ggdb -D__LE__ -msoft-float -mabi=32 -march=4kc -I/home/accounts/helenos-ci/nightly/tmp-ci/build/mips32-malta-le/coast/helenos/include/posix -I/home/accounts/helenos-ci/nightly/tmp-ci/build/mips32-malta-le/coast/helenos/include/ -I/home/accounts/helenos-ci/nightly/tmp-ci/build/mips32-malta-le/coast/helenos/include/libc/ -Wno-error -c -o arch/win32/mmap.o arch/win32/mmap.c
/usr/local/cross/mips32/bin/mipsel-linux-gnu-gcc -O3 -imacros /home/accounts/helenos-ci/nightly/tmp-ci/build/mips32-malta-le/coast/helenos/include/system_config.h -fexec-charset=UTF-8 -fwide-exec-charset=UTF-32LE -finput-charset=UTF-8 -ffreestanding -fno-builtin -ffunction-sections -nostdlib -nostdinc -Wall -Wextra -Wno-clobbered -Wno-unused-parameter -Wmissing-prototypes -std=gnu99 -Wwrite-strings -pipe -ggdb -D__LE__ -msoft-float -mabi=32 -march=4kc -I/home/accounts/helenos-ci/nightly/tmp-ci/build/mips32-malta-le/coast/helenos/include/posix -I/home/accounts/helenos-ci/nightly/tmp-ci/build/mips32-malta-le/coast/helenos/include/ -I/home/accounts/helenos-ci/nightly/tmp-ci/build/mips32-malta-le/coast/helenos/include/libc/ -Wno-error -c -o arch/win32/stdin.o arch/win32/stdin.c
/usr/local/cross/mips32/bin/mipsel-linux-gnu-gcc -O3 -imacros /home/accounts/helenos-ci/nightly/tmp-ci/build/mips32-malta-le/coast/helenos/include/system_config.h -fexec-charset=UTF-8 -fwide-exec-charset=UTF-32LE -finput-charset=UTF-8 -ffreestanding -fno-builtin -ffunction-sections -nostdlib -nostdinc -Wall -Wextra -Wno-clobbered -Wno-unused-parameter -Wmissing-prototypes -std=gnu99 -Wwrite-strings -pipe -ggdb -D__LE__ -msoft-float -mabi=32 -march=4kc -I/home/accounts/helenos-ci/nightly/tmp-ci/build/mips32-malta-le/coast/helenos/include/posix -I/home/accounts/helenos-ci/nightly/tmp-ci/build/mips32-malta-le/coast/helenos/include/ -I/home/accounts/helenos-ci/nightly/tmp-ci/build/mips32-malta-le/coast/helenos/include/libc/ -Wno-error -c -o arch/win32/signal.o arch/win32/signal.c
/usr/local/cross/mips32/bin/mipsel-linux-gnu-gcc -O3 -imacros /home/accounts/helenos-ci/nightly/tmp-ci/build/mips32-malta-le/coast/helenos/include/system_config.h -fexec-charset=UTF-8 -fwide-exec-charset=UTF-32LE -finput-charset=UTF-8 -ffreestanding -fno-builtin -ffunction-sections -nostdlib -nostdinc -Wall -Wextra -Wno-clobbered -Wno-unused-parameter -Wmissing-prototypes -std=gnu99 -Wwrite-strings -pipe -ggdb -D__LE__ -msoft-float -mabi=32 -march=4kc -I/home/accounts/helenos-ci/nightly/tmp-ci/build/mips32-malta-le/coast/helenos/include/posix -I/home/accounts/helenos-ci/nightly/tmp-ci/build/mips32-malta-le/coast/helenos/include/ -I/home/accounts/helenos-ci/nightly/tmp-ci/build/mips32-malta-le/coast/helenos/include/libc/ -Wno-error -c -o arch/posix/signal.o arch/posix/signal.c
/usr/local/cross/mips32/bin/mipsel-linux-gnu-ld -o msim utils.o fault.o text.o env.o cline.o cmd.o check.o main.o parser.o list.o arch/helenos/input.o arch/helenos/misc.o io/output.o cpu/cpu.o cpu/instr.o debug/debug.o debug/breakpoint.o device/machine.o device/mem.o device/ddisk.o device/dcpu.o device/dkeyboard.o device/dorder.o device/dprinter.o device/dtime.o device/device.o arch/win32/mmap.o arch/win32/stdin.o arch/win32/signal.o arch/posix/signal.o -lclui -L/home/accounts/helenos-ci/nightly/tmp-ci/build/mips32-malta-le/coast/helenos/lib/other --fatal-warnings --gc-sections -L/home/accounts/helenos-ci/nightly/tmp-ci/build/mips32-malta-le/coast/helenos/lib -n -T /home/accounts/helenos-ci/nightly/tmp-ci/build/mips32-malta-le/coast/helenos/link.ld --whole-archive --start-group -lposixaslibc -lsoftint -lsoftfloat --end-group --no-whole-archive -lc4posix
make: Leaving directory '/home/accounts/helenos-ci/nightly/tmp-ci/build/mips32-malta-le/coast/build/msim/msim-1.3.8.1/src'
>>> Packaging...
[hsct]: "mkdir" "-p" "/home/accounts/helenos-ci/nightly/tmp-ci/build/mips32-malta-le/coast/dist//msim/app/" 
[hsct]: "cp" "src/msim" "/home/accounts/helenos-ci/nightly/tmp-ci/build/mips32-malta-le/coast/dist//msim/app/" 
>>> Creating the tarball...
fdlibm OK fdlibm for mips32/malta-le View (tail) 7 s
s_tanh.c:57:2: warning: dereferencing type-punned pointer will break strict-aliasing rules [-Wstrict-aliasing]
  jx = __HI(x);
  ^~
/usr/local/cross/mips32/bin/mipsel-linux-gnu-ar cru libfdm.a k_standard.o k_rem_pio2.o k_cos.o k_sin.o k_tan.o e_acos.o e_acosh.o e_asin.o e_atan2.o e_atanh.o e_cosh.o e_exp.o e_fmod.o e_gamma.o e_gamma_r.o e_hypot.o e_j0.o e_j1.o e_jn.o e_lgamma.o e_lgamma_r.o e_log.o e_log10.o e_pow.o e_rem_pio2.o e_remainder.o e_scalb.o e_sinh.o e_sqrt.o w_acos.o w_acosh.o w_asin.o w_atan2.o w_atanh.o w_cosh.o w_exp.o w_fmod.o w_gamma.o w_gamma_r.o w_hypot.o w_j0.o w_j1.o w_jn.o w_lgamma.o w_lgamma_r.o w_log.o w_log10.o w_pow.o w_remainder.o w_scalb.o w_sinh.o w_sqrt.o s_asinh.o s_atan.o s_cbrt.o s_ceil.o s_copysign.o s_cos.o s_erf.o s_expm1.o s_fabs.o s_finite.o s_floor.o s_frexp.o s_ilogb.o s_isnan.o s_ldexp.o s_lib_version.o s_log1p.o s_logb.o s_matherr.o s_modf.o s_nextafter.o s_rint.o s_scalbn.o s_signgam.o s_significand.o s_sin.o s_tan.o s_tanh.o
/usr/local/cross/mips32/bin/mipsel-linux-gnu-ranlib libfdm.a || true
>>> Packaging...
[hsct]: "cp" "fdlibm53/libfdm.a" "/home/accounts/helenos-ci/nightly/tmp-ci/build/mips32-malta-le/coast/libs/" 
[hsct]: "mkdir" "-p" "/home/accounts/helenos-ci/nightly/tmp-ci/build/mips32-malta-le/coast/dist//fdlibm/lib" 
[hsct]: "cp" "fdlibm53/libfdm.a" "/home/accounts/helenos-ci/nightly/tmp-ci/build/mips32-malta-le/coast/dist//fdlibm/lib/" 
>>> Creating the tarball...
libiconv OK libiconv for mips32/malta-le View (tail) 87 s
make[1]: Leaving directory '/home/accounts/helenos-ci/nightly/tmp-ci/build/mips32-malta-le/coast/build/libiconv/libiconv-1.14/man'
[hsct]: "cp" "PKG/usr/local/include/iconv.h" "PKG/usr/local/include/libcharset.h" "PKG/usr/local/include/localcharset.h" "/home/accounts/helenos-ci/nightly/tmp-ci/build/mips32-malta-le/coast/include/" 
[hsct]: "cp" "PKG/usr/local/lib/libcharset.a" "PKG/usr/local/lib/libiconv.a" "/home/accounts/helenos-ci/nightly/tmp-ci/build/mips32-malta-le/coast/libs/" 
[hsct]: "mkdir" "-p" "/home/accounts/helenos-ci/nightly/tmp-ci/build/mips32-malta-le/coast/dist//libiconv/inc/c" 
[hsct]: "cp" "PKG/usr/local/include/iconv.h" "PKG/usr/local/include/libcharset.h" "PKG/usr/local/include/localcharset.h" "/home/accounts/helenos-ci/nightly/tmp-ci/build/mips32-malta-le/coast/dist//libiconv/inc/c" 
[hsct]: "mkdir" "-p" "/home/accounts/helenos-ci/nightly/tmp-ci/build/mips32-malta-le/coast/dist//libiconv/lib" 
[hsct]: "cp" "PKG/usr/local/lib/libcharset.a" "PKG/usr/local/lib/libiconv.a" "/home/accounts/helenos-ci/nightly/tmp-ci/build/mips32-malta-le/coast/dist//libiconv/lib" 
[hsct]: "mkdir" "-p" "/home/accounts/helenos-ci/nightly/tmp-ci/build/mips32-malta-le/coast/dist//libiconv/app/" 
[hsct]: "cp" "PKG/usr/local/bin/iconv" "/home/accounts/helenos-ci/nightly/tmp-ci/build/mips32-malta-le/coast/dist//libiconv/app/" 
>>> Creating the tarball...
pcc Failed View (tail) 1 s
                   ^~~~~~~~~
cc.c: In function 'main':
cc.c:366:21: error: 'VERSSTR' undeclared (first use in this function)
      printf("%s\n", VERSSTR);
                     ^~~~~~~
cc.c:366:21: note: each undeclared identifier is reported only once for each function it appears in
/home/accounts/helenos-ci/nightly/tmp-ci/build/mips32-malta-le/helenos/uspace/Makefile.common:385: recipe for target 'cc.o' failed
make: *** [cc.o] Error 1
make: Leaving directory '/home/accounts/helenos-ci/nightly/tmp-ci/build/mips32-malta-le/coast/build/pcc/pcc-1.0.0/cc/cc'
[hsct]: Error: Build failed!
jainja OK jainja for mips32/malta-le View (tail) 1 min 57 s
   if (((count - start) | start) < 0 || start > end)
       ~~~~~~~~~~~~~~~~~~~~~~~~~~~~~~^~~~~~~~~~~~~~
/usr/local/cross/mips32/bin/mipsel-linux-gnu-ld -o jainja fdlibm53/k_standard.o fdlibm53/k_rem_pio2.o fdlibm53/k_cos.o fdlibm53/k_sin.o fdlibm53/k_tan.o fdlibm53/e_acos.o fdlibm53/e_acosh.o fdlibm53/e_asin.o fdlibm53/e_atan2.o fdlibm53/e_atanh.o fdlibm53/e_cosh.o fdlibm53/e_exp.o fdlibm53/e_fmod.o fdlibm53/e_gamma.o fdlibm53/e_gamma_r.o fdlibm53/e_hypot.o fdlibm53/e_j0.o fdlibm53/e_j1.o fdlibm53/e_jn.o fdlibm53/e_lgamma.o fdlibm53/e_lgamma_r.o fdlibm53/e_log.o fdlibm53/e_log10.o fdlibm53/e_pow.o fdlibm53/e_rem_pio2.o fdlibm53/e_remainder.o fdlibm53/e_scalb.o fdlibm53/e_sinh.o fdlibm53/e_sqrt.o fdlibm53/w_acos.o fdlibm53/w_acosh.o fdlibm53/w_asin.o fdlibm53/w_atan2.o fdlibm53/w_atanh.o fdlibm53/w_cosh.o fdlibm53/w_exp.o fdlibm53/w_fmod.o fdlibm53/w_gamma.o fdlibm53/w_gamma_r.o fdlibm53/w_hypot.o fdlibm53/w_j0.o fdlibm53/w_j1.o fdlibm53/w_jn.o fdlibm53/w_lgamma.o fdlibm53/w_lgamma_r.o fdlibm53/w_log.o fdlibm53/w_log10.o fdlibm53/w_pow.o fdlibm53/w_remainder.o fdlibm53/w_scalb.o fdlibm53/w_sinh.o fdlibm53/w_sqrt.o fdlibm53/s_asinh.o fdlibm53/s_atan.o fdlibm53/s_cbrt.o fdlibm53/s_ceil.o fdlibm53/s_copysign.o fdlibm53/s_tan.o fdlibm53/s_tanh.o fdlibm53/s_cos.o fdlibm53/s_erf.o fdlibm53/s_expm1.o fdlibm53/s_fabs.o fdlibm53/s_finite.o fdlibm53/s_floor.o fdlibm53/s_frexp.o fdlibm53/s_ilogb.o fdlibm53/s_isnan.o fdlibm53/s_ldexp.o fdlibm53/s_lib_version.o fdlibm53/s_log1p.o fdlibm53/s_logb.o fdlibm53/s_matherr.o fdlibm53/s_modf.o fdlibm53/s_rint.o fdlibm53/s_scalbn.o fdlibm53/s_signgam.o fdlibm53/s_significand.o fdlibm53/s_sin.o fdlibm53/s_nextafter.o src/tinygc/LP_Allocator.o src/tinygc/tinygc.o src/jainja/Main.o -L/home/accounts/helenos-ci/nightly/tmp-ci/build/mips32-malta-le/coast/helenos/lib/other --fatal-warnings --gc-sections -L/home/accounts/helenos-ci/nightly/tmp-ci/build/mips32-malta-le/coast/helenos/lib -n -T /home/accounts/helenos-ci/nightly/tmp-ci/build/mips32-malta-le/coast/helenos/link.ld --whole-archive --start-group -lposixaslibc -lsoftint -lsoftfloat --end-group --no-whole-archive -lc4posix
make: Leaving directory '/home/accounts/helenos-ci/nightly/tmp-ci/build/mips32-malta-le/coast/build/jainja/jainja-0.8-helenos/jainja'
>>> Packaging...
[hsct]: "mkdir" "-p" "/home/accounts/helenos-ci/nightly/tmp-ci/build/mips32-malta-le/coast/dist//jainja/app/" 
[hsct]: "cp" "jainja/jainja" "/home/accounts/helenos-ci/nightly/tmp-ci/build/mips32-malta-le/coast/dist//jainja/app/" 
[hsct]: "cp" "rt.jar" "/home/accounts/helenos-ci/nightly/tmp-ci/build/mips32-malta-le/coast/dist//jainja/app/" 
[hsct]: "cp" "jainja.batch" "/home/accounts/helenos-ci/nightly/tmp-ci/build/mips32-malta-le/coast/dist//jainja/app/" 
>>> Creating the tarball...
zlib OK zlib for mips32/malta-le View (tail) 8 s
chmod 644 /home/accounts/helenos-ci/nightly/tmp-ci/build/mips32-malta-le/coast/build/zlib/zlib-1.2.11/PKG/usr/local/include/zlib.h /home/accounts/helenos-ci/nightly/tmp-ci/build/mips32-malta-le/coast/build/zlib/zlib-1.2.11/PKG/usr/local/include/zconf.h
[hsct]: "cp" "PKG/usr/local/include/zlib.h" "PKG/usr/local/include/zconf.h" "/home/accounts/helenos-ci/nightly/tmp-ci/build/mips32-malta-le/coast/include/" 
[hsct]: "cp" "PKG/usr/local/lib/libz.a" "/home/accounts/helenos-ci/nightly/tmp-ci/build/mips32-malta-le/coast/libs/" 
[hsct]: "mkdir" "-p" "/home/accounts/helenos-ci/nightly/tmp-ci/build/mips32-malta-le/coast/dist//zlib/inc/c" 
[hsct]: "cp" "PKG/usr/local/include/zlib.h" "PKG/usr/local/include/zconf.h" "/home/accounts/helenos-ci/nightly/tmp-ci/build/mips32-malta-le/coast/dist//zlib/inc/c" 
[hsct]: "mkdir" "-p" "/home/accounts/helenos-ci/nightly/tmp-ci/build/mips32-malta-le/coast/dist//zlib/lib" 
[hsct]: "cp" "PKG/usr/local/lib/libz.a" "/home/accounts/helenos-ci/nightly/tmp-ci/build/mips32-malta-le/coast/dist//zlib/lib" 
[hsct]: "mkdir" "-p" "/home/accounts/helenos-ci/nightly/tmp-ci/build/mips32-malta-le/coast/dist//zlib/app/" 
[hsct]: "cp" "minigzip" "minigzip64" "/home/accounts/helenos-ci/nightly/tmp-ci/build/mips32-malta-le/coast/dist//zlib/app/" 
>>> Creating the tarball...
libgmp OK libgmp for mips32/malta-le View (tail) 2 min 6 s
[hsct]: "cp" "./t-constants" "/home/accounts/helenos-ci/nightly/tmp-ci/build/mips32-malta-le/coast/dist//libgmp/tests/libgmp/./t-constants" 
[hsct]: "cp" "./t-modlinv" "/home/accounts/helenos-ci/nightly/tmp-ci/build/mips32-malta-le/coast/dist//libgmp/tests/libgmp/./t-modlinv" 
[hsct]: "cp" "./t-popc" "/home/accounts/helenos-ci/nightly/tmp-ci/build/mips32-malta-le/coast/dist//libgmp/tests/libgmp/./t-popc" 
[hsct]: "cp" "./t-count_zeros" "/home/accounts/helenos-ci/nightly/tmp-ci/build/mips32-malta-le/coast/dist//libgmp/tests/libgmp/./t-count_zeros" 
[hsct]: "cp" "./t-bswap" "/home/accounts/helenos-ci/nightly/tmp-ci/build/mips32-malta-le/coast/dist//libgmp/tests/libgmp/./t-bswap" 
[hsct]: "cp" "./t-gmpmax" "/home/accounts/helenos-ci/nightly/tmp-ci/build/mips32-malta-le/coast/dist//libgmp/tests/libgmp/./t-gmpmax" 
[hsct]: "cp" "./t-sub" "/home/accounts/helenos-ci/nightly/tmp-ci/build/mips32-malta-le/coast/dist//libgmp/tests/libgmp/./t-sub" 
[hsct]: "cp" "./t-hightomask" "/home/accounts/helenos-ci/nightly/tmp-ci/build/mips32-malta-le/coast/dist//libgmp/tests/libgmp/./t-hightomask" 
[hsct]: "cp" "./t-parity" "/home/accounts/helenos-ci/nightly/tmp-ci/build/mips32-malta-le/coast/dist//libgmp/tests/libgmp/./t-parity" 
>>> Creating the tarball...
binutils OK binutils for mips32/malta-le View (tail) 2 min 38 s
test -z "/usr/local/share/man/man1" || /usr/bin/mkdir -p "/home/accounts/helenos-ci/nightly/tmp-ci/build/mips32-malta-le/coast/build/binutils/binutils-2.21.1/PKG/usr/local/share/man/man1"
 /usr/bin/install -c -m 644 ld.1 '/home/accounts/helenos-ci/nightly/tmp-ci/build/mips32-malta-le/coast/build/binutils/binutils-2.21.1/PKG/usr/local/share/man/man1'
make[4]: Leaving directory '/home/accounts/helenos-ci/nightly/tmp-ci/build/mips32-malta-le/coast/build/binutils/binutils-2.21.1/ld'
make[3]: Leaving directory '/home/accounts/helenos-ci/nightly/tmp-ci/build/mips32-malta-le/coast/build/binutils/binutils-2.21.1/ld'
make[2]: Leaving directory '/home/accounts/helenos-ci/nightly/tmp-ci/build/mips32-malta-le/coast/build/binutils/binutils-2.21.1/ld'
make[1]: Leaving directory '/home/accounts/helenos-ci/nightly/tmp-ci/build/mips32-malta-le/coast/build/binutils/binutils-2.21.1/ld'
[hsct]: "mkdir" "-p" "/home/accounts/helenos-ci/nightly/tmp-ci/build/mips32-malta-le/coast/dist//binutils/app/" 
[hsct]: "cp" "PKG/usr/local/bin/as" "/home/accounts/helenos-ci/nightly/tmp-ci/build/mips32-malta-le/coast/dist//binutils/app/" 
[hsct]: "cp" "PKG/usr/local/bin/ld" "/home/accounts/helenos-ci/nightly/tmp-ci/build/mips32-malta-le/coast/dist//binutils/app/" 
>>> Creating the tarball...
python2 Failed View (tail) 4 min 39 s
/home/accounts/helenos-ci/nightly/tmp-ci/build/mips32-malta-le/coast/build/python2/python-cross/./Modules/posixmodule.c:2506: undefined reference to `readdir'
/home/accounts/helenos-ci/nightly/tmp-ci/build/mips32-malta-le/coast/build/python2/python-cross/./Modules/posixmodule.c:2506: undefined reference to `readdir'
/home/accounts/helenos-ci/nightly/tmp-ci/build/mips32-malta-le/coast/build/python2/python-cross/./Modules/posixmodule.c:2556: undefined reference to `closedir'
/home/accounts/helenos-ci/nightly/tmp-ci/build/mips32-malta-le/coast/build/python2/python-cross/./Modules/posixmodule.c:2556: undefined reference to `closedir'
/home/accounts/helenos-ci/nightly/tmp-ci/build/mips32-malta-le/coast/build/python2/python-cross/./Modules/posixmodule.c:2513: undefined reference to `closedir'
/home/accounts/helenos-ci/nightly/tmp-ci/build/mips32-malta-le/coast/build/python2/python-cross/./Modules/posixmodule.c:2513: undefined reference to `closedir'
collect2: error: ld returned 1 exit status
Makefile:458: recipe for target 'python' failed
make: *** [python] Error 1
[hsct]: Error: Build failed!
libpng OK libpng for mips32/malta-le View (tail) 34 s
[hsct]: "cp" "/home/accounts/helenos-ci/nightly/tmp-ci/build/mips32-malta-le/coast/libs/libpng16.a" "/home/accounts/helenos-ci/nightly/tmp-ci/build/mips32-malta-le/coast/libs/libpng.a" 
[hsct]: "mkdir" "-p" "/home/accounts/helenos-ci/nightly/tmp-ci/build/mips32-malta-le/coast/dist//libpng/inc/c" 
[hsct]: "cp" "PKG/usr/local/include/libpng16/pngconf.h" "PKG/usr/local/include/libpng16/png.h" "PKG/usr/local/include/libpng16/pnglibconf.h" "/home/accounts/helenos-ci/nightly/tmp-ci/build/mips32-malta-le/coast/dist//libpng/inc/c" 
[hsct]: "mkdir" "-p" "/home/accounts/helenos-ci/nightly/tmp-ci/build/mips32-malta-le/coast/dist//libpng/lib" 
[hsct]: "cp" "PKG/usr/local/lib/libpng16.a" "/home/accounts/helenos-ci/nightly/tmp-ci/build/mips32-malta-le/coast/dist//libpng/lib" 
[hsct]: "cp" "/home/accounts/helenos-ci/nightly/tmp-ci/build/mips32-malta-le/coast/libs/libpng16.a" "/home/accounts/helenos-ci/nightly/tmp-ci/build/mips32-malta-le/coast/dist//libpng/lib/libpng.a" 
[hsct]: "mkdir" "-p" "/home/accounts/helenos-ci/nightly/tmp-ci/build/mips32-malta-le/coast/dist//libpng/app/" 
[hsct]: "cp" "pngfix" "png-fix-itxt" "pngtest" "/home/accounts/helenos-ci/nightly/tmp-ci/build/mips32-malta-le/coast/dist//libpng/app/" 
[hsct]: "cp" "pngtest.png" "/home/accounts/helenos-ci/nightly/tmp-ci/build/mips32-malta-le/coast/dist//libpng/" 
>>> Creating the tarball...
libisl OK libisl for mips32/malta-le View (tail) 1 min 41 s
[hsct]: "cp" "PKG/usr/local/lib/libisl.a" "/home/accounts/helenos-ci/nightly/tmp-ci/build/mips32-malta-le/coast/libs/" 
[hsct]: "mkdir" "-p" "/home/accounts/helenos-ci/nightly/tmp-ci/build/mips32-malta-le/coast/dist//libisl/inc/c/isl" 
[hsct]: "cp" "PKG/usr/local/include/isl/aff.h" "PKG/usr/local/include/isl/aff_type.h" "PKG/usr/local/include/isl/arg.h" "PKG/usr/local/include/isl/ast_build.h" "PKG/usr/local/include/isl/ast.h" "PKG/usr/local/include/isl/band.h" "PKG/usr/local/include/isl/blk.h" "PKG/usr/local/include/isl/config.h" "PKG/usr/local/include/isl/constraint.h" "PKG/usr/local/include/isl/ctx.h" "PKG/usr/local/include/isl/dim.h" "PKG/usr/local/include/isl/flow.h" "PKG/usr/local/include/isl/hash.h" "PKG/usr/local/include/isl/id.h" "PKG/usr/local/include/isl/ilp.h" "PKG/usr/local/include/isl/int.h" "PKG/usr/local/include/isl/list.h" "PKG/usr/local/include/isl/local_space.h" "PKG/usr/local/include/isl/lp.h" "PKG/usr/local/include/isl/map.h" "PKG/usr/local/include/isl/map_type.h" "PKG/usr/local/include/isl/mat.h" "PKG/usr/local/include/isl/multi.h" "PKG/usr/local/include/isl/obj.h" "PKG/usr/local/include/isl/options.h" "PKG/usr/local/include/isl/point.h" "PKG/usr/local/include/isl/polynomial.h" "PKG/usr/local/include/isl/polynomial_type.h" "PKG/usr/local/include/isl/printer.h" "PKG/usr/local/include/isl/schedule.h" "PKG/usr/local/include/isl/seq.h" "PKG/usr/local/include/isl/set.h" "PKG/usr/local/include/isl/set_type.h" "PKG/usr/local/include/isl/space.h" "PKG/usr/local/include/isl/stdint.h" "PKG/usr/local/include/isl/stream.h" "PKG/usr/local/include/isl/union_map.h" "PKG/usr/local/include/isl/union_map_type.h" "PKG/usr/local/include/isl/union_set.h" "PKG/usr/local/include/isl/union_set_type.h" "PKG/usr/local/include/isl/vec.h" "PKG/usr/local/include/isl/version.h" "PKG/usr/local/include/isl/vertices.h" "/home/accounts/helenos-ci/nightly/tmp-ci/build/mips32-malta-le/coast/dist//libisl/inc/c/isl" 
[hsct]: "mkdir" "-p" "/home/accounts/helenos-ci/nightly/tmp-ci/build/mips32-malta-le/coast/dist//libisl/lib" 
[hsct]: "cp" "PKG/usr/local/lib/libisl.a" "/home/accounts/helenos-ci/nightly/tmp-ci/build/mips32-malta-le/coast/dist//libisl/lib" 
>>> Preparing tests...
[hsct]: "mkdir" "-p" "/home/accounts/helenos-ci/nightly/tmp-ci/build/mips32-malta-le/coast/dist//libisl/tests/libisl/" 
[hsct]: "cp" "isl_pip" "/home/accounts/helenos-ci/nightly/tmp-ci/build/mips32-malta-le/coast/dist//libisl/tests/libisl/" 
[hsct]: "cp" "boulet.pip" "brisebarre.pip" "cg1.pip" "esced.pip" "ex2.pip" "ex.pip" "fimmel.pip" "max.pip" "negative.pip" "seghir-vd.pip" "small.pip" "sor1d.pip" "square.pip" "sven.pip" "tobi.pip" "/home/accounts/helenos-ci/nightly/tmp-ci/build/mips32-malta-le/coast/dist//libisl/tests/libisl/" 
>>> Creating the tarball...
libmpfr OK libmpfr for mips32/malta-le View (tail) 8 min 32 s
[hsct]: "cp" "./tset_d" "/home/accounts/helenos-ci/nightly/tmp-ci/build/mips32-malta-le/coast/dist//libmpfr/tests/libmpfr/./tset_d" 
[hsct]: "cp" "./tisnan" "/home/accounts/helenos-ci/nightly/tmp-ci/build/mips32-malta-le/coast/dist//libmpfr/tests/libmpfr/./tisnan" 
[hsct]: "cp" "./tsprintf" "/home/accounts/helenos-ci/nightly/tmp-ci/build/mips32-malta-le/coast/dist//libmpfr/tests/libmpfr/./tsprintf" 
[hsct]: "cp" "./tadd1sp" "/home/accounts/helenos-ci/nightly/tmp-ci/build/mips32-malta-le/coast/dist//libmpfr/tests/libmpfr/./tadd1sp" 
[hsct]: "cp" "./tl2b" "/home/accounts/helenos-ci/nightly/tmp-ci/build/mips32-malta-le/coast/dist//libmpfr/tests/libmpfr/./tl2b" 
[hsct]: "cp" "./tsin_cos" "/home/accounts/helenos-ci/nightly/tmp-ci/build/mips32-malta-le/coast/dist//libmpfr/tests/libmpfr/./tsin_cos" 
[hsct]: "cp" "./taway" "/home/accounts/helenos-ci/nightly/tmp-ci/build/mips32-malta-le/coast/dist//libmpfr/tests/libmpfr/./taway" 
[hsct]: "cp" "./tset_sj" "/home/accounts/helenos-ci/nightly/tmp-ci/build/mips32-malta-le/coast/dist//libmpfr/tests/libmpfr/./tset_sj" 
[hsct]: "cp" "./tpow3" "/home/accounts/helenos-ci/nightly/tmp-ci/build/mips32-malta-le/coast/dist//libmpfr/tests/libmpfr/./tpow3" 
>>> Creating the tarball...
libmpc OK libmpc for mips32/malta-le View (tail) 2 min 59 s
[hsct]: "cp" "./tacosh" "/home/accounts/helenos-ci/nightly/tmp-ci/build/mips32-malta-le/coast/dist//libmpc/tests/libmpc/./tacosh" 
[hsct]: "cp" "./tproj" "/home/accounts/helenos-ci/nightly/tmp-ci/build/mips32-malta-le/coast/dist//libmpc/tests/libmpc/./tproj" 
[hsct]: "cp" "./tadd_fr" "/home/accounts/helenos-ci/nightly/tmp-ci/build/mips32-malta-le/coast/dist//libmpc/tests/libmpc/./tadd_fr" 
[hsct]: "cp" "./tpow_ui" "/home/accounts/helenos-ci/nightly/tmp-ci/build/mips32-malta-le/coast/dist//libmpc/tests/libmpc/./tpow_ui" 
[hsct]: "cp" "./tsub_fr" "/home/accounts/helenos-ci/nightly/tmp-ci/build/mips32-malta-le/coast/dist//libmpc/tests/libmpc/./tsub_fr" 
[hsct]: "cp" "./tstrtoc" "/home/accounts/helenos-ci/nightly/tmp-ci/build/mips32-malta-le/coast/dist//libmpc/tests/libmpc/./tstrtoc" 
[hsct]: "cp" "./tneg" "/home/accounts/helenos-ci/nightly/tmp-ci/build/mips32-malta-le/coast/dist//libmpc/tests/libmpc/./tneg" 
[hsct]: "cp" "./tsin_cos" "/home/accounts/helenos-ci/nightly/tmp-ci/build/mips32-malta-le/coast/dist//libmpc/tests/libmpc/./tsin_cos" 
[hsct]: "cp" "./tdiv_2ui" "/home/accounts/helenos-ci/nightly/tmp-ci/build/mips32-malta-le/coast/dist//libmpc/tests/libmpc/./tdiv_2ui" 
>>> Creating the tarball...
gcc Failed View (tail) 10 min 22 s
/usr/local/cross/mips32/lib/gcc/mipsel-linux-gnu/6.1.0/../../../../mipsel-linux-gnu/bin/as: out of memory allocating 4064 bytes after a total of 290816 bytes
{standard input}: Assembler messages:
{standard input}:1: Fatal error: can't close sched-deps.o: Memory exhausted
virtual memory exhausted: Cannot allocate memory
Makefile:1074: recipe for target 'sched-deps.o' failed
make[1]: *** [sched-deps.o] Error 2
make[1]: Leaving directory '/home/accounts/helenos-ci/nightly/tmp-ci/build/mips32-malta-le/coast/build/gcc/build/gcc'
Makefile:5246: recipe for target 'all-gcc' failed
make: *** [all-gcc] Error 2
[hsct]: Error: Build failed!

mips32/msim(back to top)

Task Result Download Log Duration
HelenOS OK HelenOS boot image View (tail) 3 min 21 s
/usr/local/cross/mips32/bin/mipsel-linux-gnu-gcc -DBOOT -DRELEASE=0.7.0 "-DCOPYRIGHT=Copyright (c) 2001-2017 HelenOS project" "-DNAME=Parabolic Potassium" -D__32_BITS__ -D__LE__ -Igeneric/include -I../abi/include -O3 -imacros ../config.h -fexec-charset=UTF-8 -fwide-exec-charset=UTF-32LE -finput-charset=UTF-8 -ffreestanding -fno-builtin -nostdlib -nostdinc -Wall -Wextra -Wno-unused-parameter -Wmissing-prototypes -std=gnu99 -Werror-implicit-function-declaration -Wwrite-strings -pipe -Werror -msoft-float -mno-abicalls -G 0 -fno-zero-initialized-in-bss -mabi=32 -march=r4000 -c generic/src/printf.c -o generic/src/printf.o
/usr/local/cross/mips32/bin/mipsel-linux-gnu-gcc -DBOOT -DRELEASE=0.7.0 "-DCOPYRIGHT=Copyright (c) 2001-2017 HelenOS project" "-DNAME=Parabolic Potassium" -D__32_BITS__ -D__LE__ -Igeneric/include -I../abi/include -O3 -imacros ../config.h -fexec-charset=UTF-8 -fwide-exec-charset=UTF-32LE -finput-charset=UTF-8 -ffreestanding -fno-builtin -nostdlib -nostdinc -Wall -Wextra -Wno-unused-parameter -Wmissing-prototypes -std=gnu99 -Werror-implicit-function-declaration -Wwrite-strings -pipe -Werror -msoft-float -mno-abicalls -G 0 -fno-zero-initialized-in-bss -mabi=32 -march=r4000 -c generic/src/str.c -o generic/src/str.o
/usr/local/cross/mips32/bin/mipsel-linux-gnu-gcc -DBOOT -DRELEASE=0.7.0 "-DCOPYRIGHT=Copyright (c) 2001-2017 HelenOS project" "-DNAME=Parabolic Potassium" -D__32_BITS__ -D__LE__ -Igeneric/include -I../abi/include -O3 -imacros ../config.h -fexec-charset=UTF-8 -fwide-exec-charset=UTF-32LE -finput-charset=UTF-8 -ffreestanding -fno-builtin -nostdlib -nostdinc -Wall -Wextra -Wno-unused-parameter -Wmissing-prototypes -std=gnu99 -Werror-implicit-function-declaration -Wwrite-strings -pipe -Werror -msoft-float -mno-abicalls -G 0 -fno-zero-initialized-in-bss -mabi=32 -march=r4000 -c generic/src/version.c -o generic/src/version.o
/usr/local/cross/mips32/bin/mipsel-linux-gnu-gcc -DBOOT -DRELEASE=0.7.0 "-DCOPYRIGHT=Copyright (c) 2001-2017 HelenOS project" "-DNAME=Parabolic Potassium" -D__32_BITS__ -D__LE__ -Igeneric/include -I../abi/include -O3 -imacros ../config.h -fexec-charset=UTF-8 -fwide-exec-charset=UTF-32LE -finput-charset=UTF-8 -ffreestanding -fno-builtin -nostdlib -nostdinc -Wall -Wextra -Wno-unused-parameter -Wmissing-prototypes -std=gnu99 -Werror-implicit-function-declaration -Wwrite-strings -pipe -Werror -msoft-float -mno-abicalls -G 0 -fno-zero-initialized-in-bss -mabi=32 -march=r4000 -c generic/src/inflate.c -o generic/src/inflate.o
/usr/local/cross/mips32/bin/mipsel-linux-gnu-gcc -DBOOT -DRELEASE=0.7.0 "-DCOPYRIGHT=Copyright (c) 2001-2017 HelenOS project" "-DNAME=Parabolic Potassium" -D__32_BITS__ -D__LE__ -Igeneric/include -I../abi/include -O3 -imacros ../config.h -fexec-charset=UTF-8 -fwide-exec-charset=UTF-32LE -finput-charset=UTF-8 -ffreestanding -fno-builtin -nostdlib -nostdinc -Wall -Wextra -Wno-unused-parameter -Wmissing-prototypes -std=gnu99 -Werror-implicit-function-declaration -Wwrite-strings -pipe -Werror -D__ASM__ -D__LINKER__ -E -x c arch/mips32/_link.ld.comp | grep -v "^\#" > arch/mips32/_link.ld
/usr/local/cross/mips32/bin/mipsel-linux-gnu-ld -n --fatal-warnings -T arch/mips32/_link.ld -M -Map image.map -o image.raw kernel.co ns.co loader.co init.co locsrv.co rd.co vfs.co logger.co ext4fs.co initrd.co arch/mips32/src/asm.o arch/mips32/src/main.o arch/mips32/src/putchar.o arch/mips32/src/_components.o genarch/src/division.o genarch/src/multiplication.o generic/src/memstr.o generic/src/printf_core.o generic/src/vprintf.o generic/src/printf.o generic/src/str.o generic/src/version.o generic/src/inflate.o
/usr/local/cross/mips32/bin/mipsel-linux-gnu-objcopy -O binary image.raw ../image.boot
[ -f Makefile.depend ] && cp -a Makefile.depend Makefile.depend.prev
make[2]: Leaving directory '/home/accounts/helenos-ci/nightly/tmp-ci/build/mips32-msim/helenos/boot'
make[1]: Leaving directory '/home/accounts/helenos-ci/nightly/tmp-ci/build/mips32-msim/helenos/boot'

ppc32(back to top)

Task Result Download Log Duration
HelenOS OK HelenOS boot image View (tail) 2 min 58 s
Total extents actually written (inc HFS) = 4017
(Size of ISO volume = 3676, HFS extra = 341)
Total translation table size: 0
Total rockridge attributes bytes: 995
Total directory bytes: 4096
Path table size(bytes): 34
Max brk space used 0
4167 extents written (8 MB)
make[2]: Leaving directory '/home/accounts/helenos-ci/nightly/tmp-ci/build/ppc32/helenos/boot'
make[1]: Leaving directory '/home/accounts/helenos-ci/nightly/tmp-ci/build/ppc32/helenos/boot'

sparc64/niagara(back to top)

Task Result Download Log Duration
HelenOS OK HelenOS boot image View (tail) 2 min 53 s
I: -input-charset not specified, using utf-8 (detected in locale settings)
Total translation table size: 0
Total rockridge attributes bytes: 914
Total directory bytes: 4096
Path table size(bytes): 38
Total extents including sparc boot = 960
Max brk space used 1a000
1110 extents written (2 MB)
make[2]: Leaving directory '/home/accounts/helenos-ci/nightly/tmp-ci/build/sparc64-niagara/helenos/boot'
make[1]: Leaving directory '/home/accounts/helenos-ci/nightly/tmp-ci/build/sparc64-niagara/helenos/boot'

sparc64/ultra(back to top)

Task Result Download Log Duration
HelenOS OK HelenOS boot image View (tail) 3 min 7 s
I: -input-charset not specified, using utf-8 (detected in locale settings)
Total translation table size: 0
Total rockridge attributes bytes: 914
Total directory bytes: 4096
Path table size(bytes): 38
Total extents including sparc boot = 960
Max brk space used 1a000
1110 extents written (2 MB)
make[2]: Leaving directory '/home/accounts/helenos-ci/nightly/tmp-ci/build/sparc64-ultra/helenos/boot'
make[1]: Leaving directory '/home/accounts/helenos-ci/nightly/tmp-ci/build/sparc64-ultra/helenos/boot'

special/abs32le(back to top)

Task Result Download Log Duration
HelenOS OK View (tail) 2 min 58 s
/usr/local/cross/ia32/bin/i686-pc-linux-gnu-ld -n --fatal-warnings -T ../../lib/c/arch/abs32le/_link.ld -M -Map test-libc.map -o test-libc test/main.test.o test/odict.test.o test/qsort.test.o test/sprintf.test.o test/str.test.o ../../lib/pcut/libpcut.a libc.a   ../../lib/c/libc.a ../../lib/softint/libsoftint.a
make[2]: Leaving directory '/home/accounts/helenos-ci/nightly/tmp-ci/build/special-abs32le/helenos/uspace/lib/c'
make[1]: Leaving directory '/home/accounts/helenos-ci/nightly/tmp-ci/build/special-abs32le/helenos/uspace'
make -r -C boot PRECHECK=
make[1]: Entering directory '/home/accounts/helenos-ci/nightly/tmp-ci/build/special-abs32le/helenos/boot'
make -r -f Makefile.empty PRECHECK=
make[2]: Entering directory '/home/accounts/helenos-ci/nightly/tmp-ci/build/special-abs32le/helenos/boot'
make[2]: Nothing to be done for 'all'.
make[2]: Leaving directory '/home/accounts/helenos-ci/nightly/tmp-ci/build/special-abs32le/helenos/boot'
make[1]: Leaving directory '/home/accounts/helenos-ci/nightly/tmp-ci/build/special-abs32le/helenos/boot'

Per-harbour details(back to top)

binutils(back to top)

Architecture Result Download Log Duration
Tarball fetch OK View (tail) 3 s
 18250K .......... .......... .......... .......... .......... 98% 78.7M 0s
 18300K .......... .......... .......... .......... .......... 98% 2.51M 0s
 18350K .......... .......... .......... .......... .......... 99% 34.9M 0s
 18400K .......... .......... .......... .......... .......... 99% 42.4M 0s
 18450K .......... .......... .......... .......... .......... 99% 63.5M 0s
 18500K .......... .......... .......... .......... .......... 99% 78.3M 0s
 18550K ..                                                    100% 21.6M=1.7s

2017-06-06 02:33:22 (10.9 MB/s) - ‘/home/accounts/helenos-ci/nightly/tmp-ci/mirror/sources/binutils-2.21.1.tar.bz2’ saved [18997755]

arm32/beaglebone Skipped View (tail)
Skipped: dependency coastline-prepare-for-arm32-beaglebone failed (or also skipped).
ia32 Skipped View (tail)
Skipped: dependency coastline-prepare-for-ia32 failed (or also skipped).
ia64/i460GX Failed View 0 s
mips32/malta-be Skipped View (tail)
Skipped: dependency coastline-prepare-for-mips32-malta-be failed (or also skipped).
mips32/malta-le OK binutils for mips32/malta-le View (tail) 2 min 38 s
test -z "/usr/local/share/man/man1" || /usr/bin/mkdir -p "/home/accounts/helenos-ci/nightly/tmp-ci/build/mips32-malta-le/coast/build/binutils/binutils-2.21.1/PKG/usr/local/share/man/man1"
 /usr/bin/install -c -m 644 ld.1 '/home/accounts/helenos-ci/nightly/tmp-ci/build/mips32-malta-le/coast/build/binutils/binutils-2.21.1/PKG/usr/local/share/man/man1'
make[4]: Leaving directory '/home/accounts/helenos-ci/nightly/tmp-ci/build/mips32-malta-le/coast/build/binutils/binutils-2.21.1/ld'
make[3]: Leaving directory '/home/accounts/helenos-ci/nightly/tmp-ci/build/mips32-malta-le/coast/build/binutils/binutils-2.21.1/ld'
make[2]: Leaving directory '/home/accounts/helenos-ci/nightly/tmp-ci/build/mips32-malta-le/coast/build/binutils/binutils-2.21.1/ld'
make[1]: Leaving directory '/home/accounts/helenos-ci/nightly/tmp-ci/build/mips32-malta-le/coast/build/binutils/binutils-2.21.1/ld'
[hsct]: "mkdir" "-p" "/home/accounts/helenos-ci/nightly/tmp-ci/build/mips32-malta-le/coast/dist//binutils/app/" 
[hsct]: "cp" "PKG/usr/local/bin/as" "/home/accounts/helenos-ci/nightly/tmp-ci/build/mips32-malta-le/coast/dist//binutils/app/" 
[hsct]: "cp" "PKG/usr/local/bin/ld" "/home/accounts/helenos-ci/nightly/tmp-ci/build/mips32-malta-le/coast/dist//binutils/app/" 
>>> Creating the tarball...

fdlibm(back to top)

Architecture Result Download Log Duration
Tarball fetch OK View (tail) 2 s
Connecting to www.validlab.com (www.validlab.com)|209.128.78.139|:80... connected.
HTTP request sent, awaiting response... 200 OK
Length: 99573 (97K) [application/x-gzip]
Saving to: ‘/home/accounts/helenos-ci/nightly/tmp-ci/mirror/sources/fdlibm53.tar.gz’

     0K .......... .......... .......... .......... .......... 51% 91.3K 1s
    50K .......... .......... .......... .......... .......   100%  266K=0.7s

2017-06-06 02:33:09 (134 KB/s) - ‘/home/accounts/helenos-ci/nightly/tmp-ci/mirror/sources/fdlibm53.tar.gz’ saved [99573/99573]

arm32/beaglebone Skipped View (tail)
Skipped: dependency coastline-prepare-for-arm32-beaglebone failed (or also skipped).
ia32 Skipped View (tail)
Skipped: dependency coastline-prepare-for-ia32 failed (or also skipped).
ia64/i460GX Failed View (tail) 7 s
  ^~
/usr/local/cross/ia64/bin/ia64-pc-linux-gnu-ar cru libfdm.a k_standard.o k_rem_pio2.o k_cos.o k_sin.o k_tan.o e_acos.o e_acosh.o e_asin.o e_atan2.o e_atanh.o e_cosh.o e_exp.o e_fmod.o e_gamma.o e_gamma_r.o e_hypot.o e_j0.o e_j1.o e_jn.o e_lgamma.o e_lgamma_r.o e_log.o e_log10.o e_pow.o e_rem_pio2.o e_remainder.o e_scalb.o e_sinh.o e_sqrt.o w_acos.o w_acosh.o w_asin.o w_atan2.o w_atanh.o w_cosh.o w_exp.o w_fmod.o w_gamma.o w_gamma_r.o w_hypot.o w_j0.o w_j1.o w_jn.o w_lgamma.o w_lgamma_r.o w_log.o w_log10.o w_pow.o w_remainder.o w_scalb.o w_sinh.o w_sqrt.o s_asinh.o s_atan.o s_cbrt.o s_ceil.o s_copysign.o s_cos.o s_erf.o s_expm1.o s_fabs.o s_finite.o s_floor.o s_frexp.o s_ilogb.o s_isnan.o s_ldexp.o s_lib_version.o s_log1p.o s_logb.o s_matherr.o s_modf.o s_nextafter.o s_rint.o s_scalbn.o s_signgam.o s_significand.o s_sin.o s_tan.o s_tanh.o
/usr/local/cross/ia64/bin/ia64-pc-linux-gnu-ranlib libfdm.a || true
>>> Packaging...
[hsct]: "cp" "fdlibm53/libfdm.a" "/home/accounts/helenos-ci/nightly/tmp-ci/build/ia64-i460GX/coast/libs/" 
[hsct]: "mkdir" "-p" "/home/accounts/helenos-ci/nightly/tmp-ci/build/ia64-i460GX/coast/dist//fdlibm/lib" 
[hsct]: "cp" "fdlibm53/libfdm.a" "/home/accounts/helenos-ci/nightly/tmp-ci/build/ia64-i460GX/coast/dist//fdlibm/lib/" 
>>> Creating the tarball...
xz: (stdin): Cannot allocate memory
[hsct]: Error: Archiving failed!
mips32/malta-be Skipped View (tail)
Skipped: dependency coastline-prepare-for-mips32-malta-be failed (or also skipped).
mips32/malta-le OK fdlibm for mips32/malta-le View (tail) 7 s
s_tanh.c:57:2: warning: dereferencing type-punned pointer will break strict-aliasing rules [-Wstrict-aliasing]
  jx = __HI(x);
  ^~
/usr/local/cross/mips32/bin/mipsel-linux-gnu-ar cru libfdm.a k_standard.o k_rem_pio2.o k_cos.o k_sin.o k_tan.o e_acos.o e_acosh.o e_asin.o e_atan2.o e_atanh.o e_cosh.o e_exp.o e_fmod.o e_gamma.o e_gamma_r.o e_hypot.o e_j0.o e_j1.o e_jn.o e_lgamma.o e_lgamma_r.o e_log.o e_log10.o e_pow.o e_rem_pio2.o e_remainder.o e_scalb.o e_sinh.o e_sqrt.o w_acos.o w_acosh.o w_asin.o w_atan2.o w_atanh.o w_cosh.o w_exp.o w_fmod.o w_gamma.o w_gamma_r.o w_hypot.o w_j0.o w_j1.o w_jn.o w_lgamma.o w_lgamma_r.o w_log.o w_log10.o w_pow.o w_remainder.o w_scalb.o w_sinh.o w_sqrt.o s_asinh.o s_atan.o s_cbrt.o s_ceil.o s_copysign.o s_cos.o s_erf.o s_expm1.o s_fabs.o s_finite.o s_floor.o s_frexp.o s_ilogb.o s_isnan.o s_ldexp.o s_lib_version.o s_log1p.o s_logb.o s_matherr.o s_modf.o s_nextafter.o s_rint.o s_scalbn.o s_signgam.o s_significand.o s_sin.o s_tan.o s_tanh.o
/usr/local/cross/mips32/bin/mipsel-linux-gnu-ranlib libfdm.a || true
>>> Packaging...
[hsct]: "cp" "fdlibm53/libfdm.a" "/home/accounts/helenos-ci/nightly/tmp-ci/build/mips32-malta-le/coast/libs/" 
[hsct]: "mkdir" "-p" "/home/accounts/helenos-ci/nightly/tmp-ci/build/mips32-malta-le/coast/dist//fdlibm/lib" 
[hsct]: "cp" "fdlibm53/libfdm.a" "/home/accounts/helenos-ci/nightly/tmp-ci/build/mips32-malta-le/coast/dist//fdlibm/lib/" 
>>> Creating the tarball...

gcc(back to top)

Architecture Result Download Log Duration
Tarball fetch OK View (tail) 2 s
 70000K .......... .......... .......... .......... .......... 99% 66.0M 0s
 70050K .......... .......... .......... .......... .......... 99% 75.5M 0s
 70100K .......... .......... .......... .......... .......... 99% 77.2M 0s
 70150K .......... .......... .......... .......... .......... 99% 73.3M 0s
 70200K .......... .......... .......... .......... .......... 99% 66.3M 0s
 70250K .......... .......... .......... .......... .......... 99% 77.3M 0s
 70300K .......... .                                          100% 70.9M=1.1s

2017-06-06 02:33:28 (60.7 MB/s) - ‘/home/accounts/helenos-ci/nightly/tmp-ci/mirror/sources/gcc-4.6.3.tar.bz2’ saved [71999439]

ia32 Skipped View (tail)
Skipped: dependency coastline-build-zlib-for-ia32 failed (or also skipped).
ia64/i460GX Skipped View (tail)
Skipped: dependency coastline-build-zlib-for-ia64-i460GX failed (or also skipped).
mips32/malta-be Skipped View (tail)
Skipped: dependency coastline-build-zlib-for-mips32-malta-be failed (or also skipped).
mips32/malta-le Failed View (tail) 10 min 22 s
/usr/local/cross/mips32/lib/gcc/mipsel-linux-gnu/6.1.0/../../../../mipsel-linux-gnu/bin/as: out of memory allocating 4064 bytes after a total of 290816 bytes
{standard input}: Assembler messages:
{standard input}:1: Fatal error: can't close sched-deps.o: Memory exhausted
virtual memory exhausted: Cannot allocate memory
Makefile:1074: recipe for target 'sched-deps.o' failed
make[1]: *** [sched-deps.o] Error 2
make[1]: Leaving directory '/home/accounts/helenos-ci/nightly/tmp-ci/build/mips32-malta-le/coast/build/gcc/build/gcc'
Makefile:5246: recipe for target 'all-gcc' failed
make: *** [all-gcc] Error 2
[hsct]: Error: Build failed!

jainja(back to top)

Architecture Result Download Log Duration
Tarball fetch OK View (tail) 3 s
  5200K .......... .......... .......... .......... .......... 94% 38.7M 0s
  5250K .......... .......... .......... .......... .......... 95% 46.9M 0s
  5300K .......... .......... .......... .......... .......... 96% 47.1M 0s
  5350K .......... .......... .......... .......... .......... 97% 47.4M 0s
  5400K .......... .......... .......... .......... .......... 98% 43.8M 0s
  5450K .......... .......... .......... .......... .......... 99% 46.6M 0s
  5500K .......... .......... .......... .......... ..        100% 47.8M=0.4s

2017-06-06 02:33:17 (13.4 MB/s) - ‘/home/accounts/helenos-ci/nightly/tmp-ci/mirror/sources/jainja-0.8-helenos.tar.gz’ saved [5675134/5675134]

arm32/beaglebone Skipped View (tail)
Skipped: dependency coastline-prepare-for-arm32-beaglebone failed (or also skipped).
ia32 Skipped View (tail)
Skipped: dependency coastline-prepare-for-ia32 failed (or also skipped).
ia64/i460GX Failed View 0 s
mips32/malta-be Skipped View (tail)
Skipped: dependency coastline-prepare-for-mips32-malta-be failed (or also skipped).
mips32/malta-le OK jainja for mips32/malta-le View (tail) 1 min 57 s
   if (((count - start) | start) < 0 || start > end)
       ~~~~~~~~~~~~~~~~~~~~~~~~~~~~~~^~~~~~~~~~~~~~
/usr/local/cross/mips32/bin/mipsel-linux-gnu-ld -o jainja fdlibm53/k_standard.o fdlibm53/k_rem_pio2.o fdlibm53/k_cos.o fdlibm53/k_sin.o fdlibm53/k_tan.o fdlibm53/e_acos.o fdlibm53/e_acosh.o fdlibm53/e_asin.o fdlibm53/e_atan2.o fdlibm53/e_atanh.o fdlibm53/e_cosh.o fdlibm53/e_exp.o fdlibm53/e_fmod.o fdlibm53/e_gamma.o fdlibm53/e_gamma_r.o fdlibm53/e_hypot.o fdlibm53/e_j0.o fdlibm53/e_j1.o fdlibm53/e_jn.o fdlibm53/e_lgamma.o fdlibm53/e_lgamma_r.o fdlibm53/e_log.o fdlibm53/e_log10.o fdlibm53/e_pow.o fdlibm53/e_rem_pio2.o fdlibm53/e_remainder.o fdlibm53/e_scalb.o fdlibm53/e_sinh.o fdlibm53/e_sqrt.o fdlibm53/w_acos.o fdlibm53/w_acosh.o fdlibm53/w_asin.o fdlibm53/w_atan2.o fdlibm53/w_atanh.o fdlibm53/w_cosh.o fdlibm53/w_exp.o fdlibm53/w_fmod.o fdlibm53/w_gamma.o fdlibm53/w_gamma_r.o fdlibm53/w_hypot.o fdlibm53/w_j0.o fdlibm53/w_j1.o fdlibm53/w_jn.o fdlibm53/w_lgamma.o fdlibm53/w_lgamma_r.o fdlibm53/w_log.o fdlibm53/w_log10.o fdlibm53/w_pow.o fdlibm53/w_remainder.o fdlibm53/w_scalb.o fdlibm53/w_sinh.o fdlibm53/w_sqrt.o fdlibm53/s_asinh.o fdlibm53/s_atan.o fdlibm53/s_cbrt.o fdlibm53/s_ceil.o fdlibm53/s_copysign.o fdlibm53/s_tan.o fdlibm53/s_tanh.o fdlibm53/s_cos.o fdlibm53/s_erf.o fdlibm53/s_expm1.o fdlibm53/s_fabs.o fdlibm53/s_finite.o fdlibm53/s_floor.o fdlibm53/s_frexp.o fdlibm53/s_ilogb.o fdlibm53/s_isnan.o fdlibm53/s_ldexp.o fdlibm53/s_lib_version.o fdlibm53/s_log1p.o fdlibm53/s_logb.o fdlibm53/s_matherr.o fdlibm53/s_modf.o fdlibm53/s_rint.o fdlibm53/s_scalbn.o fdlibm53/s_signgam.o fdlibm53/s_significand.o fdlibm53/s_sin.o fdlibm53/s_nextafter.o src/tinygc/LP_Allocator.o src/tinygc/tinygc.o src/jainja/Main.o -L/home/accounts/helenos-ci/nightly/tmp-ci/build/mips32-malta-le/coast/helenos/lib/other --fatal-warnings --gc-sections -L/home/accounts/helenos-ci/nightly/tmp-ci/build/mips32-malta-le/coast/helenos/lib -n -T /home/accounts/helenos-ci/nightly/tmp-ci/build/mips32-malta-le/coast/helenos/link.ld --whole-archive --start-group -lposixaslibc -lsoftint -lsoftfloat --end-group --no-whole-archive -lc4posix
make: Leaving directory '/home/accounts/helenos-ci/nightly/tmp-ci/build/mips32-malta-le/coast/build/jainja/jainja-0.8-helenos/jainja'
>>> Packaging...
[hsct]: "mkdir" "-p" "/home/accounts/helenos-ci/nightly/tmp-ci/build/mips32-malta-le/coast/dist//jainja/app/" 
[hsct]: "cp" "jainja/jainja" "/home/accounts/helenos-ci/nightly/tmp-ci/build/mips32-malta-le/coast/dist//jainja/app/" 
[hsct]: "cp" "rt.jar" "/home/accounts/helenos-ci/nightly/tmp-ci/build/mips32-malta-le/coast/dist//jainja/app/" 
[hsct]: "cp" "jainja.batch" "/home/accounts/helenos-ci/nightly/tmp-ci/build/mips32-malta-le/coast/dist//jainja/app/" 
>>> Creating the tarball...

libgmp(back to top)

Architecture Result Download Log Duration
Tarball fetch OK View (tail) 1 s
  1800K .......... .......... .......... .......... .......... 86% 30.7M 0s
  1850K .......... .......... .......... .......... .......... 88% 30.7M 0s
  1900K .......... .......... .......... .......... .......... 90% 31.1M 0s
  1950K .......... .......... .......... .......... .......... 93% 25.2M 0s
  2000K .......... .......... .......... .......... .......... 95% 2.09M 0s
  2050K .......... .......... .......... .......... .......... 97% 45.1M 0s
  2100K .......... .......... .......... .......... ...       100% 51.9M=0.5s

2017-06-06 02:33:19 (4.41 MB/s) - ‘/home/accounts/helenos-ci/nightly/tmp-ci/mirror/sources/gmp-5.1.0.tar.bz2’ saved [2194942/2194942]

arm32/beaglebone Skipped View (tail)
Skipped: dependency coastline-prepare-for-arm32-beaglebone failed (or also skipped).
ia32 Skipped View (tail)
Skipped: dependency coastline-prepare-for-ia32 failed (or also skipped).
ia64/i460GX Failed View 0 s
mips32/malta-be Skipped View (tail)
Skipped: dependency coastline-prepare-for-mips32-malta-be failed (or also skipped).
mips32/malta-le OK libgmp for mips32/malta-le View (tail) 2 min 6 s
[hsct]: "cp" "./t-constants" "/home/accounts/helenos-ci/nightly/tmp-ci/build/mips32-malta-le/coast/dist//libgmp/tests/libgmp/./t-constants" 
[hsct]: "cp" "./t-modlinv" "/home/accounts/helenos-ci/nightly/tmp-ci/build/mips32-malta-le/coast/dist//libgmp/tests/libgmp/./t-modlinv" 
[hsct]: "cp" "./t-popc" "/home/accounts/helenos-ci/nightly/tmp-ci/build/mips32-malta-le/coast/dist//libgmp/tests/libgmp/./t-popc" 
[hsct]: "cp" "./t-count_zeros" "/home/accounts/helenos-ci/nightly/tmp-ci/build/mips32-malta-le/coast/dist//libgmp/tests/libgmp/./t-count_zeros" 
[hsct]: "cp" "./t-bswap" "/home/accounts/helenos-ci/nightly/tmp-ci/build/mips32-malta-le/coast/dist//libgmp/tests/libgmp/./t-bswap" 
[hsct]: "cp" "./t-gmpmax" "/home/accounts/helenos-ci/nightly/tmp-ci/build/mips32-malta-le/coast/dist//libgmp/tests/libgmp/./t-gmpmax" 
[hsct]: "cp" "./t-sub" "/home/accounts/helenos-ci/nightly/tmp-ci/build/mips32-malta-le/coast/dist//libgmp/tests/libgmp/./t-sub" 
[hsct]: "cp" "./t-hightomask" "/home/accounts/helenos-ci/nightly/tmp-ci/build/mips32-malta-le/coast/dist//libgmp/tests/libgmp/./t-hightomask" 
[hsct]: "cp" "./t-parity" "/home/accounts/helenos-ci/nightly/tmp-ci/build/mips32-malta-le/coast/dist//libgmp/tests/libgmp/./t-parity" 
>>> Creating the tarball...

libiconv(back to top)

Architecture Result Download Log Duration
Tarball fetch OK View (tail) 1 s
  4550K .......... .......... .......... .......... .......... 94% 57.1M 0s
  4600K .......... .......... .......... .......... .......... 95% 80.7M 0s
  4650K .......... .......... .......... .......... .......... 96% 79.6M 0s
  4700K .......... .......... .......... .......... .......... 97% 69.6M 0s
  4750K .......... .......... .......... .......... .......... 98% 80.9M 0s
  4800K .......... .......... .......... .......... .......... 99% 79.5M 0s
  4850K .......... .......                                    100% 68.9M=0.9s

2017-06-06 02:33:10 (5.02 MB/s) - ‘/home/accounts/helenos-ci/nightly/tmp-ci/mirror/sources/libiconv-1.14.tar.gz’ saved [4984397/4984397]

arm32/beaglebone Skipped View (tail)
Skipped: dependency coastline-prepare-for-arm32-beaglebone failed (or also skipped).
ia32 Skipped View (tail)
Skipped: dependency coastline-prepare-for-ia32 failed (or also skipped).
ia64/i460GX Failed View (tail) 4 s
checking if /usr/local/cross/ia64/bin/ia64-pc-linux-gnu-gcc supports -c -o file.o... (cached) no
checking if we can lock with hard links... yes
checking whether the /usr/local/cross/ia64/bin/ia64-pc-linux-gnu-gcc linker (/usr/local/cross/ia64/bin/ia64-pc-linux-gnu-ld) supports shared libraries... yes
checking dynamic linker characteristics... ./configure: fork: Cannot allocate memory
./configure: fork: Cannot allocate memory
[hsct]: "sed" "s#cp .libs/libiconv.so preloadable_libiconv.so#touch preloadable_libiconv.so#" "-i" "preload/Makefile" 
sed: can't read preload/Makefile: No such file or directory
[hsct]: "make" "STATIC_ONLY=y" 
make: *** No targets specified and no makefile found.  Stop.
[hsct]: Error: Build failed!
mips32/malta-be Skipped View (tail)
Skipped: dependency coastline-prepare-for-mips32-malta-be failed (or also skipped).
mips32/malta-le OK libiconv for mips32/malta-le View (tail) 87 s
make[1]: Leaving directory '/home/accounts/helenos-ci/nightly/tmp-ci/build/mips32-malta-le/coast/build/libiconv/libiconv-1.14/man'
[hsct]: "cp" "PKG/usr/local/include/iconv.h" "PKG/usr/local/include/libcharset.h" "PKG/usr/local/include/localcharset.h" "/home/accounts/helenos-ci/nightly/tmp-ci/build/mips32-malta-le/coast/include/" 
[hsct]: "cp" "PKG/usr/local/lib/libcharset.a" "PKG/usr/local/lib/libiconv.a" "/home/accounts/helenos-ci/nightly/tmp-ci/build/mips32-malta-le/coast/libs/" 
[hsct]: "mkdir" "-p" "/home/accounts/helenos-ci/nightly/tmp-ci/build/mips32-malta-le/coast/dist//libiconv/inc/c" 
[hsct]: "cp" "PKG/usr/local/include/iconv.h" "PKG/usr/local/include/libcharset.h" "PKG/usr/local/include/localcharset.h" "/home/accounts/helenos-ci/nightly/tmp-ci/build/mips32-malta-le/coast/dist//libiconv/inc/c" 
[hsct]: "mkdir" "-p" "/home/accounts/helenos-ci/nightly/tmp-ci/build/mips32-malta-le/coast/dist//libiconv/lib" 
[hsct]: "cp" "PKG/usr/local/lib/libcharset.a" "PKG/usr/local/lib/libiconv.a" "/home/accounts/helenos-ci/nightly/tmp-ci/build/mips32-malta-le/coast/dist//libiconv/lib" 
[hsct]: "mkdir" "-p" "/home/accounts/helenos-ci/nightly/tmp-ci/build/mips32-malta-le/coast/dist//libiconv/app/" 
[hsct]: "cp" "PKG/usr/local/bin/iconv" "/home/accounts/helenos-ci/nightly/tmp-ci/build/mips32-malta-le/coast/dist//libiconv/app/" 
>>> Creating the tarball...

libisl(back to top)

Architecture Result Download Log Duration
Tarball fetch OK View (tail) 0 s
   900K .......... .......... .......... .......... .......... 78% 74.9M 0s
   950K .......... .......... .......... .......... .......... 82% 76.7M 0s
  1000K .......... .......... .......... .......... .......... 86% 64.6M 0s
  1050K .......... .......... .......... .......... .......... 90% 76.8M 0s
  1100K .......... .......... .......... .......... .......... 94% 77.8M 0s
  1150K .......... .......... .......... .......... .......... 98% 76.4M 0s
  1200K .......... .....                                      100% 63.7M=0.1s

2017-06-06 02:33:25 (8.28 MB/s) - ‘/home/accounts/helenos-ci/nightly/tmp-ci/mirror/sources/isl-0.11.1.tar.bz2’ saved [1244610/1244610]

arm32/beaglebone Skipped View (tail)
Skipped: dependency coastline-build-libgmp-for-arm32-beaglebone failed (or also skipped).
ia32 Skipped View (tail)
Skipped: dependency coastline-build-libgmp-for-ia32 failed (or also skipped).
ia64/i460GX Skipped View (tail)
Skipped: dependency coastline-build-libgmp-for-ia64-i460GX failed (or also skipped).
mips32/malta-be Skipped View (tail)
Skipped: dependency coastline-build-libgmp-for-mips32-malta-be failed (or also skipped).
mips32/malta-le OK libisl for mips32/malta-le View (tail) 1 min 41 s
[hsct]: "cp" "PKG/usr/local/lib/libisl.a" "/home/accounts/helenos-ci/nightly/tmp-ci/build/mips32-malta-le/coast/libs/" 
[hsct]: "mkdir" "-p" "/home/accounts/helenos-ci/nightly/tmp-ci/build/mips32-malta-le/coast/dist//libisl/inc/c/isl" 
[hsct]: "cp" "PKG/usr/local/include/isl/aff.h" "PKG/usr/local/include/isl/aff_type.h" "PKG/usr/local/include/isl/arg.h" "PKG/usr/local/include/isl/ast_build.h" "PKG/usr/local/include/isl/ast.h" "PKG/usr/local/include/isl/band.h" "PKG/usr/local/include/isl/blk.h" "PKG/usr/local/include/isl/config.h" "PKG/usr/local/include/isl/constraint.h" "PKG/usr/local/include/isl/ctx.h" "PKG/usr/local/include/isl/dim.h" "PKG/usr/local/include/isl/flow.h" "PKG/usr/local/include/isl/hash.h" "PKG/usr/local/include/isl/id.h" "PKG/usr/local/include/isl/ilp.h" "PKG/usr/local/include/isl/int.h" "PKG/usr/local/include/isl/list.h" "PKG/usr/local/include/isl/local_space.h" "PKG/usr/local/include/isl/lp.h" "PKG/usr/local/include/isl/map.h" "PKG/usr/local/include/isl/map_type.h" "PKG/usr/local/include/isl/mat.h" "PKG/usr/local/include/isl/multi.h" "PKG/usr/local/include/isl/obj.h" "PKG/usr/local/include/isl/options.h" "PKG/usr/local/include/isl/point.h" "PKG/usr/local/include/isl/polynomial.h" "PKG/usr/local/include/isl/polynomial_type.h" "PKG/usr/local/include/isl/printer.h" "PKG/usr/local/include/isl/schedule.h" "PKG/usr/local/include/isl/seq.h" "PKG/usr/local/include/isl/set.h" "PKG/usr/local/include/isl/set_type.h" "PKG/usr/local/include/isl/space.h" "PKG/usr/local/include/isl/stdint.h" "PKG/usr/local/include/isl/stream.h" "PKG/usr/local/include/isl/union_map.h" "PKG/usr/local/include/isl/union_map_type.h" "PKG/usr/local/include/isl/union_set.h" "PKG/usr/local/include/isl/union_set_type.h" "PKG/usr/local/include/isl/vec.h" "PKG/usr/local/include/isl/version.h" "PKG/usr/local/include/isl/vertices.h" "/home/accounts/helenos-ci/nightly/tmp-ci/build/mips32-malta-le/coast/dist//libisl/inc/c/isl" 
[hsct]: "mkdir" "-p" "/home/accounts/helenos-ci/nightly/tmp-ci/build/mips32-malta-le/coast/dist//libisl/lib" 
[hsct]: "cp" "PKG/usr/local/lib/libisl.a" "/home/accounts/helenos-ci/nightly/tmp-ci/build/mips32-malta-le/coast/dist//libisl/lib" 
>>> Preparing tests...
[hsct]: "mkdir" "-p" "/home/accounts/helenos-ci/nightly/tmp-ci/build/mips32-malta-le/coast/dist//libisl/tests/libisl/" 
[hsct]: "cp" "isl_pip" "/home/accounts/helenos-ci/nightly/tmp-ci/build/mips32-malta-le/coast/dist//libisl/tests/libisl/" 
[hsct]: "cp" "boulet.pip" "brisebarre.pip" "cg1.pip" "esced.pip" "ex2.pip" "ex.pip" "fimmel.pip" "max.pip" "negative.pip" "seghir-vd.pip" "small.pip" "sor1d.pip" "square.pip" "sven.pip" "tobi.pip" "/home/accounts/helenos-ci/nightly/tmp-ci/build/mips32-malta-le/coast/dist//libisl/tests/libisl/" 
>>> Creating the tarball...

libmpc(back to top)

Architecture Result Download Log Duration
Tarball fetch OK View (tail) 0 s
   300K .......... .......... .......... .......... .......... 57% 70.9M 0s
   350K .......... .......... .......... .......... .......... 65% 75.5M 0s
   400K .......... .......... .......... .......... .......... 73% 1.39M 0s
   450K .......... .......... .......... .......... .......... 82% 55.1M 0s
   500K .......... .......... .......... .......... .......... 90% 66.4M 0s
   550K .......... .......... .......... .......... .......... 98% 66.3M 0s
   600K .........                                             100% 59.1M=0.2s

2017-06-06 02:33:26 (3.07 MB/s) - ‘/home/accounts/helenos-ci/nightly/tmp-ci/mirror/sources/mpc-1.0.1.tar.gz’ saved [624125/624125]

ia32 Skipped View (tail)
Skipped: dependency coastline-build-libmpfr-for-ia32 failed (or also skipped).
ia64/i460GX Skipped View (tail)
Skipped: dependency coastline-build-libmpfr-for-ia64-i460GX failed (or also skipped).
mips32/malta-be Skipped View (tail)
Skipped: dependency coastline-build-libmpfr-for-mips32-malta-be failed (or also skipped).
mips32/malta-le OK libmpc for mips32/malta-le View (tail) 2 min 59 s
[hsct]: "cp" "./tacosh" "/home/accounts/helenos-ci/nightly/tmp-ci/build/mips32-malta-le/coast/dist//libmpc/tests/libmpc/./tacosh" 
[hsct]: "cp" "./tproj" "/home/accounts/helenos-ci/nightly/tmp-ci/build/mips32-malta-le/coast/dist//libmpc/tests/libmpc/./tproj" 
[hsct]: "cp" "./tadd_fr" "/home/accounts/helenos-ci/nightly/tmp-ci/build/mips32-malta-le/coast/dist//libmpc/tests/libmpc/./tadd_fr" 
[hsct]: "cp" "./tpow_ui" "/home/accounts/helenos-ci/nightly/tmp-ci/build/mips32-malta-le/coast/dist//libmpc/tests/libmpc/./tpow_ui" 
[hsct]: "cp" "./tsub_fr" "/home/accounts/helenos-ci/nightly/tmp-ci/build/mips32-malta-le/coast/dist//libmpc/tests/libmpc/./tsub_fr" 
[hsct]: "cp" "./tstrtoc" "/home/accounts/helenos-ci/nightly/tmp-ci/build/mips32-malta-le/coast/dist//libmpc/tests/libmpc/./tstrtoc" 
[hsct]: "cp" "./tneg" "/home/accounts/helenos-ci/nightly/tmp-ci/build/mips32-malta-le/coast/dist//libmpc/tests/libmpc/./tneg" 
[hsct]: "cp" "./tsin_cos" "/home/accounts/helenos-ci/nightly/tmp-ci/build/mips32-malta-le/coast/dist//libmpc/tests/libmpc/./tsin_cos" 
[hsct]: "cp" "./tdiv_2ui" "/home/accounts/helenos-ci/nightly/tmp-ci/build/mips32-malta-le/coast/dist//libmpc/tests/libmpc/./tdiv_2ui" 
>>> Creating the tarball...

libmpfr(back to top)

Architecture Result Download Log Duration
Tarball fetch OK View (tail) 1 s
   850K .......... .......... .......... .......... .......... 75% 1.84M 0s
   900K .......... .......... .......... .......... .......... 79% 39.6M 0s
   950K .......... .......... .......... .......... .......... 84% 1.82M 0s
  1000K .......... .......... .......... .......... .......... 88% 1.82M 0s
  1050K .......... .......... .......... .......... .......... 92% 1.82M 0s
  1100K .......... .......... .......... .......... .......... 96% 39.3M 0s
  1150K .......... .......... .......... ..........           100% 1.49M=0.7s

2017-06-06 02:33:26 (1.65 MB/s) - ‘/home/accounts/helenos-ci/nightly/tmp-ci/mirror/sources/mpfr-3.1.1.tar.bz2’ saved [1218825/1218825]

arm32/beaglebone Skipped View (tail)
Skipped: dependency coastline-build-fdlibm-for-arm32-beaglebone failed (or also skipped).
ia32 Skipped View (tail)
Skipped: dependency coastline-build-fdlibm-for-ia32 failed (or also skipped).
ia64/i460GX Skipped View (tail)
Skipped: dependency coastline-build-fdlibm-for-ia64-i460GX failed (or also skipped).
mips32/malta-be Skipped View (tail)
Skipped: dependency coastline-build-fdlibm-for-mips32-malta-be failed (or also skipped).
mips32/malta-le OK libmpfr for mips32/malta-le View (tail) 8 min 32 s
[hsct]: "cp" "./tset_d" "/home/accounts/helenos-ci/nightly/tmp-ci/build/mips32-malta-le/coast/dist//libmpfr/tests/libmpfr/./tset_d" 
[hsct]: "cp" "./tisnan" "/home/accounts/helenos-ci/nightly/tmp-ci/build/mips32-malta-le/coast/dist//libmpfr/tests/libmpfr/./tisnan" 
[hsct]: "cp" "./tsprintf" "/home/accounts/helenos-ci/nightly/tmp-ci/build/mips32-malta-le/coast/dist//libmpfr/tests/libmpfr/./tsprintf" 
[hsct]: "cp" "./tadd1sp" "/home/accounts/helenos-ci/nightly/tmp-ci/build/mips32-malta-le/coast/dist//libmpfr/tests/libmpfr/./tadd1sp" 
[hsct]: "cp" "./tl2b" "/home/accounts/helenos-ci/nightly/tmp-ci/build/mips32-malta-le/coast/dist//libmpfr/tests/libmpfr/./tl2b" 
[hsct]: "cp" "./tsin_cos" "/home/accounts/helenos-ci/nightly/tmp-ci/build/mips32-malta-le/coast/dist//libmpfr/tests/libmpfr/./tsin_cos" 
[hsct]: "cp" "./taway" "/home/accounts/helenos-ci/nightly/tmp-ci/build/mips32-malta-le/coast/dist//libmpfr/tests/libmpfr/./taway" 
[hsct]: "cp" "./tset_sj" "/home/accounts/helenos-ci/nightly/tmp-ci/build/mips32-malta-le/coast/dist//libmpfr/tests/libmpfr/./tset_sj" 
[hsct]: "cp" "./tpow3" "/home/accounts/helenos-ci/nightly/tmp-ci/build/mips32-malta-le/coast/dist//libmpfr/tests/libmpfr/./tpow3" 
>>> Creating the tarball...

libpng(back to top)

Architecture Result Download Log Duration
Tarball fetch OK View (tail) 1 s
  1000K .......... .......... .......... .......... .......... 79% 43.8M 0s
  1050K .......... .......... .......... .......... .......... 83% 47.6M 0s
  1100K .......... .......... .......... .......... .......... 86% 47.1M 0s
  1150K .......... .......... .......... .......... .......... 90% 47.1M 0s
  1200K .......... .......... .......... .......... .......... 94% 5.85M 0s
  1250K .......... .......... .......... .......... .......... 98% 46.6M 0s
  1300K .......... .......... ..                              100% 52.7M=0.2s

2017-06-06 02:33:25 (6.40 MB/s) - ‘/home/accounts/helenos-ci/nightly/tmp-ci/mirror/sources/libpng-1.6.12.tar.gz’ saved [1354223/1354223]

arm32/beaglebone Skipped View (tail)
Skipped: dependency coastline-build-zlib-for-arm32-beaglebone failed (or also skipped).
ia32 Skipped View (tail)
Skipped: dependency coastline-build-zlib-for-ia32 failed (or also skipped).
ia64/i460GX Skipped View (tail)
Skipped: dependency coastline-build-zlib-for-ia64-i460GX failed (or also skipped).
mips32/malta-be Skipped View (tail)
Skipped: dependency coastline-build-zlib-for-mips32-malta-be failed (or also skipped).
mips32/malta-le OK libpng for mips32/malta-le View (tail) 34 s
[hsct]: "cp" "/home/accounts/helenos-ci/nightly/tmp-ci/build/mips32-malta-le/coast/libs/libpng16.a" "/home/accounts/helenos-ci/nightly/tmp-ci/build/mips32-malta-le/coast/libs/libpng.a" 
[hsct]: "mkdir" "-p" "/home/accounts/helenos-ci/nightly/tmp-ci/build/mips32-malta-le/coast/dist//libpng/inc/c" 
[hsct]: "cp" "PKG/usr/local/include/libpng16/pngconf.h" "PKG/usr/local/include/libpng16/png.h" "PKG/usr/local/include/libpng16/pnglibconf.h" "/home/accounts/helenos-ci/nightly/tmp-ci/build/mips32-malta-le/coast/dist//libpng/inc/c" 
[hsct]: "mkdir" "-p" "/home/accounts/helenos-ci/nightly/tmp-ci/build/mips32-malta-le/coast/dist//libpng/lib" 
[hsct]: "cp" "PKG/usr/local/lib/libpng16.a" "/home/accounts/helenos-ci/nightly/tmp-ci/build/mips32-malta-le/coast/dist//libpng/lib" 
[hsct]: "cp" "/home/accounts/helenos-ci/nightly/tmp-ci/build/mips32-malta-le/coast/libs/libpng16.a" "/home/accounts/helenos-ci/nightly/tmp-ci/build/mips32-malta-le/coast/dist//libpng/lib/libpng.a" 
[hsct]: "mkdir" "-p" "/home/accounts/helenos-ci/nightly/tmp-ci/build/mips32-malta-le/coast/dist//libpng/app/" 
[hsct]: "cp" "pngfix" "png-fix-itxt" "pngtest" "/home/accounts/helenos-ci/nightly/tmp-ci/build/mips32-malta-le/coast/dist//libpng/app/" 
[hsct]: "cp" "pngtest.png" "/home/accounts/helenos-ci/nightly/tmp-ci/build/mips32-malta-le/coast/dist//libpng/" 
>>> Creating the tarball...

msim(back to top)

Architecture Result Download Log Duration
Tarball fetch OK View (tail) 0 s
Length: 167755 (164K) [application/x-bzip2]
Saving to: ‘/home/accounts/helenos-ci/nightly/tmp-ci/mirror/sources/msim-1.3.8.1.tar.bz2’

     0K .......... .......... .......... .......... .......... 30% 35.3M 0s
    50K .......... .......... .......... .......... .......... 61% 31.7M 0s
   100K .......... .......... .......... .......... .......... 91% 37.7M 0s
   150K .......... ...                                        100% 26.8M=0.005s

2017-06-06 02:33:07 (33.9 MB/s) - ‘/home/accounts/helenos-ci/nightly/tmp-ci/mirror/sources/msim-1.3.8.1.tar.bz2’ saved [167755/167755]

arm32/beaglebone Skipped View (tail)
Skipped: dependency coastline-prepare-for-arm32-beaglebone failed (or also skipped).
ia32 Skipped View (tail)
Skipped: dependency coastline-prepare-for-ia32 failed (or also skipped).
ia64/i460GX OK msim for ia64/i460GX View (tail) 7 s
/usr/local/cross/ia64/bin/ia64-pc-linux-gnu-gcc -O3 -imacros /home/accounts/helenos-ci/nightly/tmp-ci/build/ia64-i460GX/coast/helenos/include/system_config.h -fexec-charset=UTF-8 -fwide-exec-charset=UTF-32LE -finput-charset=UTF-8 -ffreestanding -fno-builtin -ffunction-sections -nostdlib -nostdinc -Wall -Wextra -Wno-clobbered -Wno-unused-parameter -Wmissing-prototypes -std=gnu99 -Wwrite-strings -pipe -ggdb -D__LE__ -fno-unwind-tables -I/home/accounts/helenos-ci/nightly/tmp-ci/build/ia64-i460GX/coast/helenos/include/posix -I/home/accounts/helenos-ci/nightly/tmp-ci/build/ia64-i460GX/coast/helenos/include/ -I/home/accounts/helenos-ci/nightly/tmp-ci/build/ia64-i460GX/coast/helenos/include/libc/ -Wno-error -c -o arch/win32/mmap.o arch/win32/mmap.c
/usr/local/cross/ia64/bin/ia64-pc-linux-gnu-gcc -O3 -imacros /home/accounts/helenos-ci/nightly/tmp-ci/build/ia64-i460GX/coast/helenos/include/system_config.h -fexec-charset=UTF-8 -fwide-exec-charset=UTF-32LE -finput-charset=UTF-8 -ffreestanding -fno-builtin -ffunction-sections -nostdlib -nostdinc -Wall -Wextra -Wno-clobbered -Wno-unused-parameter -Wmissing-prototypes -std=gnu99 -Wwrite-strings -pipe -ggdb -D__LE__ -fno-unwind-tables -I/home/accounts/helenos-ci/nightly/tmp-ci/build/ia64-i460GX/coast/helenos/include/posix -I/home/accounts/helenos-ci/nightly/tmp-ci/build/ia64-i460GX/coast/helenos/include/ -I/home/accounts/helenos-ci/nightly/tmp-ci/build/ia64-i460GX/coast/helenos/include/libc/ -Wno-error -c -o arch/win32/stdin.o arch/win32/stdin.c
/usr/local/cross/ia64/bin/ia64-pc-linux-gnu-gcc -O3 -imacros /home/accounts/helenos-ci/nightly/tmp-ci/build/ia64-i460GX/coast/helenos/include/system_config.h -fexec-charset=UTF-8 -fwide-exec-charset=UTF-32LE -finput-charset=UTF-8 -ffreestanding -fno-builtin -ffunction-sections -nostdlib -nostdinc -Wall -Wextra -Wno-clobbered -Wno-unused-parameter -Wmissing-prototypes -std=gnu99 -Wwrite-strings -pipe -ggdb -D__LE__ -fno-unwind-tables -I/home/accounts/helenos-ci/nightly/tmp-ci/build/ia64-i460GX/coast/helenos/include/posix -I/home/accounts/helenos-ci/nightly/tmp-ci/build/ia64-i460GX/coast/helenos/include/ -I/home/accounts/helenos-ci/nightly/tmp-ci/build/ia64-i460GX/coast/helenos/include/libc/ -Wno-error -c -o arch/win32/signal.o arch/win32/signal.c
/usr/local/cross/ia64/bin/ia64-pc-linux-gnu-gcc -O3 -imacros /home/accounts/helenos-ci/nightly/tmp-ci/build/ia64-i460GX/coast/helenos/include/system_config.h -fexec-charset=UTF-8 -fwide-exec-charset=UTF-32LE -finput-charset=UTF-8 -ffreestanding -fno-builtin -ffunction-sections -nostdlib -nostdinc -Wall -Wextra -Wno-clobbered -Wno-unused-parameter -Wmissing-prototypes -std=gnu99 -Wwrite-strings -pipe -ggdb -D__LE__ -fno-unwind-tables -I/home/accounts/helenos-ci/nightly/tmp-ci/build/ia64-i460GX/coast/helenos/include/posix -I/home/accounts/helenos-ci/nightly/tmp-ci/build/ia64-i460GX/coast/helenos/include/ -I/home/accounts/helenos-ci/nightly/tmp-ci/build/ia64-i460GX/coast/helenos/include/libc/ -Wno-error -c -o arch/posix/signal.o arch/posix/signal.c
/usr/local/cross/ia64/bin/ia64-pc-linux-gnu-ld -o msim utils.o fault.o text.o env.o cline.o cmd.o check.o main.o parser.o list.o arch/helenos/input.o arch/helenos/misc.o io/output.o cpu/cpu.o cpu/instr.o debug/debug.o debug/breakpoint.o device/machine.o device/mem.o device/ddisk.o device/dcpu.o device/dkeyboard.o device/dorder.o device/dprinter.o device/dtime.o device/device.o arch/win32/mmap.o arch/win32/stdin.o arch/win32/signal.o arch/posix/signal.o -lclui -L/home/accounts/helenos-ci/nightly/tmp-ci/build/ia64-i460GX/coast/helenos/lib/other --fatal-warnings -L/home/accounts/helenos-ci/nightly/tmp-ci/build/ia64-i460GX/coast/helenos/lib -n -T /home/accounts/helenos-ci/nightly/tmp-ci/build/ia64-i460GX/coast/helenos/link.ld --whole-archive --start-group -lposixaslibc -lsoftint  --end-group --no-whole-archive -lc4posix
make: Leaving directory '/home/accounts/helenos-ci/nightly/tmp-ci/build/ia64-i460GX/coast/build/msim/msim-1.3.8.1/src'
>>> Packaging...
[hsct]: "mkdir" "-p" "/home/accounts/helenos-ci/nightly/tmp-ci/build/ia64-i460GX/coast/dist//msim/app/" 
[hsct]: "cp" "src/msim" "/home/accounts/helenos-ci/nightly/tmp-ci/build/ia64-i460GX/coast/dist//msim/app/" 
>>> Creating the tarball...
mips32/malta-be Skipped View (tail)
Skipped: dependency coastline-prepare-for-mips32-malta-be failed (or also skipped).
mips32/malta-le OK msim for mips32/malta-le View (tail) 5 s
/usr/local/cross/mips32/bin/mipsel-linux-gnu-gcc -O3 -imacros /home/accounts/helenos-ci/nightly/tmp-ci/build/mips32-malta-le/coast/helenos/include/system_config.h -fexec-charset=UTF-8 -fwide-exec-charset=UTF-32LE -finput-charset=UTF-8 -ffreestanding -fno-builtin -ffunction-sections -nostdlib -nostdinc -Wall -Wextra -Wno-clobbered -Wno-unused-parameter -Wmissing-prototypes -std=gnu99 -Wwrite-strings -pipe -ggdb -D__LE__ -msoft-float -mabi=32 -march=4kc -I/home/accounts/helenos-ci/nightly/tmp-ci/build/mips32-malta-le/coast/helenos/include/posix -I/home/accounts/helenos-ci/nightly/tmp-ci/build/mips32-malta-le/coast/helenos/include/ -I/home/accounts/helenos-ci/nightly/tmp-ci/build/mips32-malta-le/coast/helenos/include/libc/ -Wno-error -c -o arch/win32/mmap.o arch/win32/mmap.c
/usr/local/cross/mips32/bin/mipsel-linux-gnu-gcc -O3 -imacros /home/accounts/helenos-ci/nightly/tmp-ci/build/mips32-malta-le/coast/helenos/include/system_config.h -fexec-charset=UTF-8 -fwide-exec-charset=UTF-32LE -finput-charset=UTF-8 -ffreestanding -fno-builtin -ffunction-sections -nostdlib -nostdinc -Wall -Wextra -Wno-clobbered -Wno-unused-parameter -Wmissing-prototypes -std=gnu99 -Wwrite-strings -pipe -ggdb -D__LE__ -msoft-float -mabi=32 -march=4kc -I/home/accounts/helenos-ci/nightly/tmp-ci/build/mips32-malta-le/coast/helenos/include/posix -I/home/accounts/helenos-ci/nightly/tmp-ci/build/mips32-malta-le/coast/helenos/include/ -I/home/accounts/helenos-ci/nightly/tmp-ci/build/mips32-malta-le/coast/helenos/include/libc/ -Wno-error -c -o arch/win32/stdin.o arch/win32/stdin.c
/usr/local/cross/mips32/bin/mipsel-linux-gnu-gcc -O3 -imacros /home/accounts/helenos-ci/nightly/tmp-ci/build/mips32-malta-le/coast/helenos/include/system_config.h -fexec-charset=UTF-8 -fwide-exec-charset=UTF-32LE -finput-charset=UTF-8 -ffreestanding -fno-builtin -ffunction-sections -nostdlib -nostdinc -Wall -Wextra -Wno-clobbered -Wno-unused-parameter -Wmissing-prototypes -std=gnu99 -Wwrite-strings -pipe -ggdb -D__LE__ -msoft-float -mabi=32 -march=4kc -I/home/accounts/helenos-ci/nightly/tmp-ci/build/mips32-malta-le/coast/helenos/include/posix -I/home/accounts/helenos-ci/nightly/tmp-ci/build/mips32-malta-le/coast/helenos/include/ -I/home/accounts/helenos-ci/nightly/tmp-ci/build/mips32-malta-le/coast/helenos/include/libc/ -Wno-error -c -o arch/win32/signal.o arch/win32/signal.c
/usr/local/cross/mips32/bin/mipsel-linux-gnu-gcc -O3 -imacros /home/accounts/helenos-ci/nightly/tmp-ci/build/mips32-malta-le/coast/helenos/include/system_config.h -fexec-charset=UTF-8 -fwide-exec-charset=UTF-32LE -finput-charset=UTF-8 -ffreestanding -fno-builtin -ffunction-sections -nostdlib -nostdinc -Wall -Wextra -Wno-clobbered -Wno-unused-parameter -Wmissing-prototypes -std=gnu99 -Wwrite-strings -pipe -ggdb -D__LE__ -msoft-float -mabi=32 -march=4kc -I/home/accounts/helenos-ci/nightly/tmp-ci/build/mips32-malta-le/coast/helenos/include/posix -I/home/accounts/helenos-ci/nightly/tmp-ci/build/mips32-malta-le/coast/helenos/include/ -I/home/accounts/helenos-ci/nightly/tmp-ci/build/mips32-malta-le/coast/helenos/include/libc/ -Wno-error -c -o arch/posix/signal.o arch/posix/signal.c
/usr/local/cross/mips32/bin/mipsel-linux-gnu-ld -o msim utils.o fault.o text.o env.o cline.o cmd.o check.o main.o parser.o list.o arch/helenos/input.o arch/helenos/misc.o io/output.o cpu/cpu.o cpu/instr.o debug/debug.o debug/breakpoint.o device/machine.o device/mem.o device/ddisk.o device/dcpu.o device/dkeyboard.o device/dorder.o device/dprinter.o device/dtime.o device/device.o arch/win32/mmap.o arch/win32/stdin.o arch/win32/signal.o arch/posix/signal.o -lclui -L/home/accounts/helenos-ci/nightly/tmp-ci/build/mips32-malta-le/coast/helenos/lib/other --fatal-warnings --gc-sections -L/home/accounts/helenos-ci/nightly/tmp-ci/build/mips32-malta-le/coast/helenos/lib -n -T /home/accounts/helenos-ci/nightly/tmp-ci/build/mips32-malta-le/coast/helenos/link.ld --whole-archive --start-group -lposixaslibc -lsoftint -lsoftfloat --end-group --no-whole-archive -lc4posix
make: Leaving directory '/home/accounts/helenos-ci/nightly/tmp-ci/build/mips32-malta-le/coast/build/msim/msim-1.3.8.1/src'
>>> Packaging...
[hsct]: "mkdir" "-p" "/home/accounts/helenos-ci/nightly/tmp-ci/build/mips32-malta-le/coast/dist//msim/app/" 
[hsct]: "cp" "src/msim" "/home/accounts/helenos-ci/nightly/tmp-ci/build/mips32-malta-le/coast/dist//msim/app/" 
>>> Creating the tarball...

pcc(back to top)

Architecture Result Download Log Duration
Tarball fetch OK View (tail) 4 s
   300K .......... .......... .......... .......... .......... 54%  569K 0s
   350K .......... .......... .......... .......... .......... 62% 1.04M 0s
   400K .......... .......... .......... .......... .......... 70%  570K 0s
   450K .......... .......... .......... .......... .......... 78% 1.06M 0s
   500K .......... .......... .......... .......... .......... 86%  570K 0s
   550K .......... .......... .......... .......... .......... 94% 1.05M 0s
   600K .......... .......... .......... .......              100%  149K=1.1s

2017-06-06 02:33:14 (558 KB/s) - ‘/home/accounts/helenos-ci/nightly/tmp-ci/mirror/sources/pcc-1.0.0.tgz’ saved [652308]

arm32/beaglebone Skipped View (tail)
Skipped: dependency coastline-prepare-for-arm32-beaglebone failed (or also skipped).
ia32 Skipped View (tail)
Skipped: dependency coastline-prepare-for-ia32 failed (or also skipped).
ia64/i460GX Failed View 0 s
mips32/malta-be Skipped View (tail)
Skipped: dependency coastline-prepare-for-mips32-malta-be failed (or also skipped).
mips32/malta-le Failed View (tail) 1 s
                   ^~~~~~~~~
cc.c: In function 'main':
cc.c:366:21: error: 'VERSSTR' undeclared (first use in this function)
      printf("%s\n", VERSSTR);
                     ^~~~~~~
cc.c:366:21: note: each undeclared identifier is reported only once for each function it appears in
/home/accounts/helenos-ci/nightly/tmp-ci/build/mips32-malta-le/helenos/uspace/Makefile.common:385: recipe for target 'cc.o' failed
make: *** [cc.o] Error 1
make: Leaving directory '/home/accounts/helenos-ci/nightly/tmp-ci/build/mips32-malta-le/coast/build/pcc/pcc-1.0.0/cc/cc'
[hsct]: Error: Build failed!

python2(back to top)

Architecture Result Download Log Duration
Tarball fetch OK View (tail) 1 s
  9850K .......... .......... .......... .......... .......... 97% 47.7M 0s
  9900K .......... .......... .......... .......... .......... 97% 48.0M 0s
  9950K .......... .......... .......... .......... .......... 98% 45.0M 0s
 10000K .......... .......... .......... .......... .......... 98% 36.2M 0s
 10050K .......... .......... .......... .......... .......... 99% 32.8M 0s
 10100K .......... .......... .......... .......... .......... 99% 35.8M 0s
 10150K .......... .......... .......... ......               100% 36.6M=0.7s

2017-06-06 02:33:23 (13.8 MB/s) - ‘/home/accounts/helenos-ci/nightly/tmp-ci/mirror/sources/Python-2.7.6.tar.xz’ saved [10431288/10431288]

arm32/beaglebone Skipped View (tail)
Skipped: dependency coastline-build-fdlibm-for-arm32-beaglebone failed (or also skipped).
ia32 Skipped View (tail)
Skipped: dependency coastline-build-fdlibm-for-ia32 failed (or also skipped).
ia64/i460GX Skipped View (tail)
Skipped: dependency coastline-build-fdlibm-for-ia64-i460GX failed (or also skipped).
mips32/malta-be Skipped View (tail)
Skipped: dependency coastline-build-fdlibm-for-mips32-malta-be failed (or also skipped).
mips32/malta-le Failed View (tail) 4 min 39 s
/home/accounts/helenos-ci/nightly/tmp-ci/build/mips32-malta-le/coast/build/python2/python-cross/./Modules/posixmodule.c:2506: undefined reference to `readdir'
/home/accounts/helenos-ci/nightly/tmp-ci/build/mips32-malta-le/coast/build/python2/python-cross/./Modules/posixmodule.c:2506: undefined reference to `readdir'
/home/accounts/helenos-ci/nightly/tmp-ci/build/mips32-malta-le/coast/build/python2/python-cross/./Modules/posixmodule.c:2556: undefined reference to `closedir'
/home/accounts/helenos-ci/nightly/tmp-ci/build/mips32-malta-le/coast/build/python2/python-cross/./Modules/posixmodule.c:2556: undefined reference to `closedir'
/home/accounts/helenos-ci/nightly/tmp-ci/build/mips32-malta-le/coast/build/python2/python-cross/./Modules/posixmodule.c:2513: undefined reference to `closedir'
/home/accounts/helenos-ci/nightly/tmp-ci/build/mips32-malta-le/coast/build/python2/python-cross/./Modules/posixmodule.c:2513: undefined reference to `closedir'
collect2: error: ld returned 1 exit status
Makefile:458: recipe for target 'python' failed
make: *** [python] Error 1
[hsct]: Error: Build failed!

zlib(back to top)

Architecture Result Download Log Duration
Tarball fetch OK View (tail) 1 s
   250K .......... .......... .......... .......... .......... 50% 25.8M 0s
   300K .......... .......... .......... .......... .......... 58% 33.8M 0s
   350K .......... .......... .......... .......... .......... 67%  480K 0s
   400K .......... .......... .......... .......... .......... 75% 47.8M 0s
   450K .......... .......... .......... .......... .......... 84% 45.0M 0s
   500K .......... .......... .......... .......... .......... 92% 43.2M 0s
   550K .......... .......... .......... .......... ...       100% 45.3M=0.5s

2017-06-06 02:33:18 (1.06 MB/s) - ‘/home/accounts/helenos-ci/nightly/tmp-ci/mirror/sources/zlib-1.2.11.tar.gz’ saved [607698/607698]

arm32/beaglebone Skipped View (tail)
Skipped: dependency coastline-prepare-for-arm32-beaglebone failed (or also skipped).
ia32 Skipped View (tail)
Skipped: dependency coastline-prepare-for-ia32 failed (or also skipped).
ia64/i460GX Failed View 0 s
mips32/malta-be Skipped View (tail)
Skipped: dependency coastline-prepare-for-mips32-malta-be failed (or also skipped).
mips32/malta-le OK zlib for mips32/malta-le View (tail) 8 s
chmod 644 /home/accounts/helenos-ci/nightly/tmp-ci/build/mips32-malta-le/coast/build/zlib/zlib-1.2.11/PKG/usr/local/include/zlib.h /home/accounts/helenos-ci/nightly/tmp-ci/build/mips32-malta-le/coast/build/zlib/zlib-1.2.11/PKG/usr/local/include/zconf.h
[hsct]: "cp" "PKG/usr/local/include/zlib.h" "PKG/usr/local/include/zconf.h" "/home/accounts/helenos-ci/nightly/tmp-ci/build/mips32-malta-le/coast/include/" 
[hsct]: "cp" "PKG/usr/local/lib/libz.a" "/home/accounts/helenos-ci/nightly/tmp-ci/build/mips32-malta-le/coast/libs/" 
[hsct]: "mkdir" "-p" "/home/accounts/helenos-ci/nightly/tmp-ci/build/mips32-malta-le/coast/dist//zlib/inc/c" 
[hsct]: "cp" "PKG/usr/local/include/zlib.h" "PKG/usr/local/include/zconf.h" "/home/accounts/helenos-ci/nightly/tmp-ci/build/mips32-malta-le/coast/dist//zlib/inc/c" 
[hsct]: "mkdir" "-p" "/home/accounts/helenos-ci/nightly/tmp-ci/build/mips32-malta-le/coast/dist//zlib/lib" 
[hsct]: "cp" "PKG/usr/local/lib/libz.a" "/home/accounts/helenos-ci/nightly/tmp-ci/build/mips32-malta-le/coast/dist//zlib/lib" 
[hsct]: "mkdir" "-p" "/home/accounts/helenos-ci/nightly/tmp-ci/build/mips32-malta-le/coast/dist//zlib/app/" 
[hsct]: "cp" "minigzip" "minigzip64" "/home/accounts/helenos-ci/nightly/tmp-ci/build/mips32-malta-le/coast/dist//zlib/app/" 
>>> Creating the tarball...

Per-scenario details(back to top)

base/fs.test(back to top)

Architecture Result Download Log Duration
amd64 OK View (tail) 5 min 55 s
   : echo 'screendump /home/accounts/helenos-ci/nightly/tmp-vm//main-full.ppm' | socat STDIN 'UNIX-CONNECT:/home/accounts/helenos-ci/nightly/tmp-vm//main.monitor'
   : xx_do_complex_text_waiting = 0
>> Forcefully killing machine main.
   : echo 'quit' | socat STDIN 'UNIX-CONNECT:/home/accounts/helenos-ci/nightly/tmp-vm//main.monitor'
# Scenario /home/accounts/helenos-ci/ci/scenarios/base/fs.test terminated, OK.

# Execution started on 2017-06-06 01:49.
# =======================================
/home/accounts/helenos-ci/ci/scenarios/base/fs.test    OK
# Execution finished on 2017-06-06 01:55.
ia32 OK View (tail) 5 min 53 s
   : echo 'screendump /home/accounts/helenos-ci/nightly/tmp-vm//main-full.ppm' | socat STDIN 'UNIX-CONNECT:/home/accounts/helenos-ci/nightly/tmp-vm//main.monitor'
   : xx_do_complex_text_waiting = 0
>> Forcefully killing machine main.
   : echo 'quit' | socat STDIN 'UNIX-CONNECT:/home/accounts/helenos-ci/nightly/tmp-vm//main.monitor'
# Scenario /home/accounts/helenos-ci/ci/scenarios/base/fs.test terminated, OK.

# Execution started on 2017-06-06 01:34.
# =======================================
/home/accounts/helenos-ci/ci/scenarios/base/fs.test    OK
# Execution finished on 2017-06-06 01:40.

base/tester_malloc1.test(back to top)

Architecture Result Download Log Duration
amd64 OK View (tail) 2 min 38 s
   : echo 'screendump /home/accounts/helenos-ci/nightly/tmp-vm//default-full.ppm' | socat STDIN 'UNIX-CONNECT:/home/accounts/helenos-ci/nightly/tmp-vm//default.monitor'
   : xx_do_complex_text_waiting = 0
>> Forcefully killing machine default.
   : echo 'quit' | socat STDIN 'UNIX-CONNECT:/home/accounts/helenos-ci/nightly/tmp-vm//default.monitor'
# Scenario /home/accounts/helenos-ci/ci/scenarios/base/tester_malloc1.test terminated, OK.

# Execution started on 2017-06-06 01:55.
# =======================================
/home/accounts/helenos-ci/ci/scenarios/base/tester_malloc1.test    OK
# Execution finished on 2017-06-06 01:57.
ia32 OK View (tail) 2 min 16 s
   : echo 'screendump /home/accounts/helenos-ci/nightly/tmp-vm//default-full.ppm' | socat STDIN 'UNIX-CONNECT:/home/accounts/helenos-ci/nightly/tmp-vm//default.monitor'
   : xx_do_complex_text_waiting = 0
>> Forcefully killing machine default.
   : echo 'quit' | socat STDIN 'UNIX-CONNECT:/home/accounts/helenos-ci/nightly/tmp-vm//default.monitor'
# Scenario /home/accounts/helenos-ci/ci/scenarios/base/tester_malloc1.test terminated, OK.

# Execution started on 2017-06-06 01:40.
# =======================================
/home/accounts/helenos-ci/ci/scenarios/base/tester_malloc1.test    OK
# Execution finished on 2017-06-06 01:42.

boot.test(back to top)

Architecture Result Download Log Duration
amd64 OK View (tail) 28 s
   : echo 'screendump /home/accounts/helenos-ci/nightly/tmp-vm//default-full.ppm' | socat STDIN 'UNIX-CONNECT:/home/accounts/helenos-ci/nightly/tmp-vm//default.monitor'
   : echo 'screendump /home/accounts/helenos-ci/nightly/tmp-vm//default-full.ppm' | socat STDIN 'UNIX-CONNECT:/home/accounts/helenos-ci/nightly/tmp-vm//default.monitor'
>> Forcefully killing machine default.
   : echo 'quit' | socat STDIN 'UNIX-CONNECT:/home/accounts/helenos-ci/nightly/tmp-vm//default.monitor'
# Scenario /home/accounts/helenos-ci/ci/scenarios/boot.test terminated, OK.

# Execution started on 2017-06-06 01:57.
# =======================================
/home/accounts/helenos-ci/ci/scenarios/boot.test    OK
# Execution finished on 2017-06-06 01:58.
ia32 OK View (tail) 39 s
   : echo 'screendump /home/accounts/helenos-ci/nightly/tmp-vm//default-full.ppm' | socat STDIN 'UNIX-CONNECT:/home/accounts/helenos-ci/nightly/tmp-vm//default.monitor'
   : echo 'screendump /home/accounts/helenos-ci/nightly/tmp-vm//default-full.ppm' | socat STDIN 'UNIX-CONNECT:/home/accounts/helenos-ci/nightly/tmp-vm//default.monitor'
>> Forcefully killing machine default.
   : echo 'quit' | socat STDIN 'UNIX-CONNECT:/home/accounts/helenos-ci/nightly/tmp-vm//default.monitor'
# Scenario /home/accounts/helenos-ci/ci/scenarios/boot.test terminated, OK.

# Execution started on 2017-06-06 01:42.
# =======================================
/home/accounts/helenos-ci/ci/scenarios/boot.test    OK
# Execution finished on 2017-06-06 01:43.

coast/gcc_base.test(back to top)

Architecture Result Download Log Duration
ia32 Skipped View (tail)
Skipped: dependency extra-ia32-with-gcc failed (or also skipped).

coast/zlib_minigzip.test(back to top)

Architecture Result Download Log Duration
ia32 Skipped View (tail)
Skipped: dependency extra-ia32-with-zlib failed (or also skipped).